id_mutation,date_mutation,numero_disposition,nature_mutation,valeur_fonciere,adresse_numero,adresse_suffixe,adresse_nom_voie,adresse_code_voie,code_postal,code_commune,nom_commune,code_departement,ancien_code_commune,ancien_nom_commune,id_parcelle,ancien_id_parcelle,numero_volume,lot1_numero,lot1_surface_carrez,lot2_numero,lot2_surface_carrez,lot3_numero,lot3_surface_carrez,lot4_numero,lot4_surface_carrez,lot5_numero,lot5_surface_carrez,nombre_lots,code_type_local,type_local,surface_reelle_bati,nombre_pieces_principales,code_nature_culture,nature_culture,code_nature_culture_speciale,nature_culture_speciale,surface_terrain,longitude,latitude
2021-1505618,2021-01-08,000001,Vente,97000,,,LE VILLAGE,B315,88390,88201,Girancourt,88,,,88201000AA0226,,,,,,,,,,,,,0,,,,,P,prés,,,618,6.30939,48.162239
2021-1505618,2021-01-08,000001,Vente,97000,,,LE VILLAGE,B315,88390,88201,Girancourt,88,,,88201000AA0227,,,,,,,,,,,,,0,,,,,P,prés,,,82,6.309264,48.162164
2021-1505618,2021-01-08,000001,Vente,97000,,,LE VILLAGE,B315,88390,88201,Girancourt,88,,,88201000AA0230,,,,,,,,,,,,,0,,,,,P,prés,,,382,6.309623,48.162192
2021-1505618,2021-01-08,000001,Vente,97000,,,LE VILLAGE,B315,88390,88201,Girancourt,88,,,88201000AA0231,,,,,,,,,,,,,0,,,,,P,prés,,,927,6.309906,48.162089
2021-1505693,2021-01-13,000001,Vente,1,,,A L AUMONE,B005,88390,88201,Girancourt,88,,,88201000ZN0068,,,,,,,,,,,,,0,,,,,L,landes,FRICH,Friche,89,6.323178,48.143315
2021-1505700,2021-01-15,000001,Vente,53000,,,LE VILLAGE,B315,88390,88201,Girancourt,88,,,88201000AA0224,,,,,,,,,,,,,0,,,,,P,prés,,,599,6.309571,48.16251
2021-1505700,2021-01-15,000001,Vente,53000,,,LE VILLAGE,B315,88390,88201,Girancourt,88,,,88201000AA0228,,,,,,,,,,,,,0,,,,,P,prés,,,401,6.309806,48.16243
2021-1505701,2021-01-13,000001,Vente,1,,,A L AUMONE,B005,88390,88201,Girancourt,88,,,88201000ZN0069,,,,,,,,,,,,,0,,,,,L,landes,FRICH,Friche,66,6.323203,48.143209
2021-1505991,2021-01-29,000001,Vente,88000,,,LA NEUVEVILLE,B211,88390,88201,Girancourt,88,,,882010000B0339,,,,,,,,,,,,,0,,,,,S,sols,,,10,6.320934,48.150508
2021-1505991,2021-01-29,000001,Vente,88000,,,LA NEUVEVILLE,B211,88390,88201,Girancourt,88,,,882010000B2425,,,,,,,,,,,,,0,,,,,T,terres,,,1642,6.321592,48.150519
2021-1505991,2021-01-29,000001,Vente,88000,,,LA NEUVEVILLE,B211,88390,88201,Girancourt,88,,,882010000B2427,,,,,,,,,,,,,0,,,,,T,terres,,,354,6.32084,48.150456
2021-1505991,2021-01-29,000001,Vente,88000,,,LA NEUVEVILLE,B211,88390,88201,Girancourt,88,,,882010000B2428,,,,,,,,,,,,,0,,,,,T,terres,,,44,6.320925,48.150327
2021-1505991,2021-01-29,000001,Vente,88000,1887,,RUE DE XERTIGNY,0047,88390,88201,Girancourt,88,,,882010000B2432,,,,,,,,,,,,,0,3,Dépendance,,0,S,sols,,,37,6.320725,48.150383
2021-1505991,2021-01-29,000001,Vente,88000,1887,,RUE DE XERTIGNY,0047,88390,88201,Girancourt,88,,,882010000B2432,,,,,,,,,,,,,0,1,Maison,71,3,S,sols,,,37,6.320725,48.150383
2021-1505991,2021-01-29,000001,Vente,88000,1887,,RUE DE XERTIGNY,0047,88390,88201,Girancourt,88,,,882010000B2432,,,,,,,,,,,,,0,1,Maison,112,6,S,sols,,,37,6.320725,48.150383
2021-1505991,2021-01-29,000001,Vente,88000,,,LA NEUVEVILLE,B211,88390,88201,Girancourt,88,,,882010000B2433,,,,,,,,,,,,,0,,,,,S,sols,,,302,6.320787,48.150357
2021-1505991,2021-01-29,000001,Vente,88000,,,LA NEUVEVILLE,B211,88390,88201,Girancourt,88,,,882010000B2439,,,,,,,,,,,,,0,,,,,P,prés,,,164,6.320503,48.150331
2021-1506120,2021-02-22,000001,Vente,56000,999,,RUE DE XERTIGNY,0047,88390,88201,Girancourt,88,,,882010000B0774,,,,,,,,,,,,,0,1,Maison,74,3,S,sols,,,595,6.316379,48.156952
2021-1506258,2021-02-05,000001,Vente,158000,,,LA NEUVEVILLE,B211,88390,88201,Girancourt,88,,,882010000B0350,,,,,,,,,,,,,0,,,,,L,landes,FRICH,Friche,47,6.320879,48.149609
2021-1506258,2021-02-05,000001,Vente,158000,1983,,RUE DE XERTIGNY,0047,88390,88201,Girancourt,88,,,882010000B0351,,,,,,,,,,,,,0,1,Maison,135,4,S,sols,,,432,6.321167,48.149621
2021-1506258,2021-02-05,000001,Vente,158000,,,LA NEUVEVILLE,B211,88390,88201,Girancourt,88,,,882010000B0352,,,,,,,,,,,,,0,,,,,P,prés,,,810,6.321684,48.149708
2021-1506258,2021-02-05,000001,Vente,158000,,,LA NEUVEVILLE,B211,88390,88201,Girancourt,88,,,882010000B0352,,,,,,,,,,,,,0,,,,,S,sols,,,310,6.321684,48.149708
2021-1506463,2021-03-08,000001,Vente,89320,695,,RUE DES PIERROTTES,0043,88390,88201,Girancourt,88,,,88201000ZA0159,,,,,,,,,,,,,0,1,Maison,105,5,J,jardins,,,776,6.301785,48.168252
2021-1506463,2021-03-08,000001,Vente,89320,695,,RUE DES PIERROTTES,0043,88390,88201,Girancourt,88,,,88201000ZA0159,,,,,,,,,,,,,0,1,Maison,105,5,S,sols,,,500,6.301785,48.168252
2021-1506529,2021-02-24,000001,Vente,139864,154,,RUE DE DARNEY,0024,88390,88201,Girancourt,88,,,88201000ZA0109,,,,,,,,,,,,,0,1,Maison,143,7,S,sols,,,498,6.305841,48.163572
2021-1506566,2021-03-09,000001,Vente,55000,,,HAUT DES MONTS,B177,88390,88201,Girancourt,88,,,88201000ZA0233,,,,,,,,,,,,,0,,,,,T,terres,,,1509,6.305054,48.171476
2021-1506897,2021-03-22,000001,Vente,9197.4,,,SOUS LE FORT DE GIRANCOURT,B330,88390,88201,Girancourt,88,,,88201000ZB0022,,,,,,,,,,,,,0,,,,,T,terres,,,3890,6.318541,48.165804
2021-1507103,2021-04-01,000001,Vente,121000,81,,ALL DU BOTENEY,0027,88390,88201,Girancourt,88,,,88201000ZO0151,,,,,,,,,,,,,0,1,Maison,76,4,S,sols,,,924,6.303424,48.16143
2021-1507288,2021-04-09,000001,Vente,185000,430,,RUE DE RENAUVOID,0045,88390,88201,Girancourt,88,,,882010000D1888,,,,,,,,,,,,,0,1,Maison,116,4,S,sols,,,500,6.333665,48.137651
2021-1507288,2021-04-09,000001,Vente,185000,430,,RUE DE RENAUVOID,0045,88390,88201,Girancourt,88,,,882010000D1888,,,,,,,,,,,,,0,1,Maison,116,4,J,jardins,,,804,6.333665,48.137651
2021-1507350,2021-05-10,000001,Vente,65000,,,CROIX DE LA FILLE,B075,88390,88201,Girancourt,88,,,882010000C1447,,,,,,,,,,,,,0,,,,,T,terres,,,2526,6.354299,48.147828
2021-1507957,2021-06-11,000001,Vente,41000,1875,,RUE DE XERTIGNY,0047,88390,88201,Girancourt,88,,,882010000B0342,,,,,,,,,,,,,0,1,Maison,48,3,S,sols,,,198,6.320651,48.150553
2021-1507957,2021-06-11,000001,Vente,41000,,,LA NEUVEVILLE,B211,88390,88201,Girancourt,88,,,882010000B2426,,,,,,,,,,,,,0,,,,,T,terres,,,1045,6.321073,48.150631
2021-1507957,2021-06-11,000001,Vente,41000,,,LA NEUVEVILLE,B211,88390,88201,Girancourt,88,,,882010000B2438,,,,,,,,,,,,,0,,,,,P,prés,,,24,6.320383,48.150534
2021-1508545,2021-06-28,000001,Vente,6000,,,L ETANG DU HAUT FAING,B116,88390,88201,Girancourt,88,,,882010000C0728,,,,,,,,,,,,,0,,,,,J,jardins,,,457,6.347873,48.142958
2021-1508545,2021-06-28,000001,Vente,6000,,,L ETANG DU HAUT FAING,B116,88390,88201,Girancourt,88,,,882010000C0729,,,,,,,,,,,,,0,,,,,BT,taillis simples,,,1233,6.347982,48.142611
2021-1508545,2021-06-28,000001,Vente,6000,,,L ETANG DU HAUT FAING,B116,88390,88201,Girancourt,88,,,882010000C1394,,,,,,,,,,,,,0,,,,,L,landes,FRICH,Friche,1886,6.347168,48.142502
2021-1508545,2021-06-28,000001,Vente,6000,,,L ETANG DU HAUT FAING,B116,88390,88201,Girancourt,88,,,882010000C1515,,,,,,,,,,,,,0,,,,,T,terres,,,1402,6.347721,48.142338
2021-1508685,2021-07-08,000001,Vente,3040,,,LE THIEHA,B304,88390,88201,Girancourt,88,,,882010000D0429,,,,,,,,,,,,,0,,,,,BT,taillis simples,,,6549,6.345505,48.130865
2021-1508685,2021-07-08,000001,Vente,3040,,,LE THIEHA,B304,88390,88201,Girancourt,88,,,882010000D0430,,,,,,,,,,,,,0,,,,,L,landes,FRICH,Friche,70,6.346103,48.130523
2021-1508685,2021-07-08,000001,Vente,3040,,,LE THIEHA,B304,88390,88201,Girancourt,88,,,882010000D0503,,,,,,,,,,,,,0,,,,,BS,taillis sous futaie,,,770,6.347481,48.128596
2021-1508685,2021-07-08,000001,Vente,3040,,,LE THIEHA,B304,88390,88201,Girancourt,88,,,882010000D0505,,,,,,,,,,,,,0,,,,,L,landes,FRICH,Friche,3050,6.34689,48.128481
2021-1509047,2021-08-11,000001,Vente,25000,,,LE VILLAGE,B315,88390,88201,Girancourt,88,,,88201000AA0225,,,,,,,,,,,,,0,,,,,S,sols,,,81,6.309512,48.16239
2021-1509047,2021-08-11,000001,Vente,25000,,,LE VILLAGE,B315,88390,88201,Girancourt,88,,,88201000AA0229,,,,,,,,,,,,,0,,,,,P,prés,,,962,6.310031,48.162347
2021-1509326,2021-08-27,000001,Vente,239395,,,LE GRAND BOUT,B141,88390,88201,Girancourt,88,,,882010000B0804,,,,,,,,,,,,,0,,,,,J,jardins,,,745,6.315599,48.155124
2021-1509326,2021-08-27,000001,Vente,239395,,,LE GRAND BOUT,B141,88390,88201,Girancourt,88,,,882010000B0805,,,,,,,,,,,,,0,,,,,VE,vergers,,,680,6.315472,48.155234
2021-1509326,2021-08-27,000001,Vente,239395,1190,,RUE DE XERTIGNY,0047,88390,88201,Girancourt,88,,,882010000B0806,,,,,,,,,,,,,0,3,Dépendance,,0,S,sols,,,345,6.315788,48.155244
2021-1509326,2021-08-27,000001,Vente,239395,1190,,RUE DE XERTIGNY,0047,88390,88201,Girancourt,88,,,882010000B0806,,,,,,,,,,,,,0,1,Maison,114,5,S,sols,,,345,6.315788,48.155244
2021-1509636,2021-08-31,000001,Vente,9800,,,BRENNECONNE,B033,88390,88201,Girancourt,88,,,882010000D0687,,,,,,,,,,,,,0,,,,,BT,taillis simples,,,10000,,
2021-1509748,2021-09-08,000001,Vente,6000,,,FOUCHE DE HARDEMONT,B132,88390,88201,Girancourt,88,,,88201000ZB0177,,,,,,,,,,,,,0,,,,,T,terres,,,870,6.317,48.154295
2021-1510327,2021-09-15,000001,Vente,227865,,,LES PETITS PARTAGES,B224,88390,88201,Girancourt,88,,,882010000B1971,,,,,,,,,,,,,0,,,,,BT,taillis simples,,,1724,6.307055,48.147089
2021-1510327,2021-09-15,000001,Vente,227865,,,SUR L ETANG COSTER,B111,88390,88201,Girancourt,88,,,88201000ZD0085,,,,,,,,,,,,,0,,,,,BT,taillis simples,,,3767,6.357934,48.148949
2021-1510327,2021-09-15,000001,Vente,227865,,,LE GUTY,B160,88390,88201,Girancourt,88,,,88201000ZL0071,,,,,,,,,,,,,0,,,,,BS,taillis sous futaie,,,1758,6.328371,48.131563
2021-1511665,2021-11-09,000001,Vente,195000,1338,,RUE DE XERTIGNY,0047,88390,88201,Girancourt,88,,,88201000ZO0181,,,,,,,,,,,,,0,2,Appartement,70,3,S,sols,,,316,6.315894,48.153995
2021-1511665,2021-11-09,000001,Vente,195000,1338,,RUE DE XERTIGNY,0047,88390,88201,Girancourt,88,,,88201000ZO0181,,,,,,,,,,,,,0,3,Dépendance,,0,S,sols,,,316,6.315894,48.153995
2021-1511665,2021-11-09,000001,Vente,195000,1338,,RUE DE XERTIGNY,0047,88390,88201,Girancourt,88,,,88201000ZO0181,,,,,,,,,,,,,0,3,Dépendance,,0,S,sols,,,316,6.315894,48.153995
2021-1511665,2021-11-09,000001,Vente,195000,1338,,RUE DE XERTIGNY,0047,88390,88201,Girancourt,88,,,88201000ZO0181,,,,,,,,,,,,,0,3,Dépendance,,0,S,sols,,,316,6.315894,48.153995
2021-1511665,2021-11-09,000001,Vente,195000,1338,,RUE DE XERTIGNY,0047,88390,88201,Girancourt,88,,,88201000ZO0181,,,,,,,,,,,,,0,3,Dépendance,,0,S,sols,,,316,6.315894,48.153995
2021-1511665,2021-11-09,000001,Vente,195000,1338,,RUE DE XERTIGNY,0047,88390,88201,Girancourt,88,,,88201000ZO0181,,,,,,,,,,,,,0,2,Appartement,70,3,S,sols,,,316,6.315894,48.153995
2021-1511665,2021-11-09,000001,Vente,195000,1338,,RUE DE XERTIGNY,0047,88390,88201,Girancourt,88,,,88201000ZO0181,,,,,,,,,,,,,0,2,Appartement,50,3,S,sols,,,316,6.315894,48.153995
2021-1511665,2021-11-09,000001,Vente,195000,,,GRANDS CHAMPS,B152,88390,88201,Girancourt,88,,,88201000ZO0184,,,,,,,,,,,,,0,,,,,S,sols,,,317,6.316145,48.153879
2021-1511665,2021-11-09,000001,Vente,195000,,,GRANDS CHAMPS,B152,88390,88201,Girancourt,88,,,88201000ZO0215,,,,,,,,,,,,,0,,,,,P,prés,,,26,6.315905,48.153784
2021-1511665,2021-11-09,000001,Vente,195000,,,GRANDS CHAMPS,B152,88390,88201,Girancourt,88,,,88201000ZO0218,,,,,,,,,,,,,0,,,,,S,sols,,,35,6.315799,48.153909
2021-1512428,2021-12-02,000001,Vente,244700,292,,RUE DE DOMMARTIN,0032,88390,88201,Girancourt,88,,,88201000ZA0218,,,,,,,,,,,,,0,1,Maison,112,6,S,sols,,,500,6.301915,48.164919
2021-1512428,2021-12-02,000001,Vente,244700,292,,RUE DE DOMMARTIN,0032,88390,88201,Girancourt,88,,,88201000ZA0218,,,,,,,,,,,,,0,1,Maison,112,6,AG,terrains d'agrément,,,700,6.301915,48.164919
2021-1512739,2021-12-17,000001,Vente,7040,,,LES PETITS PARTAGES,B224,88390,88201,Girancourt,88,,,882010000B1964,,,,,,,,,,,,,0,,,,,BT,taillis simples,,,3266,6.307675,48.146636
2021-1512993,2021-12-15,000001,Vente,126000,223,,RUE D EPINAL,0033,88390,88201,Girancourt,88,,,88201000AA0012,,,4,99.32,,,,,,,,,1,2,Appartement,88,3,,,,,,6.308082,48.165751
2021-1513049,2021-12-20,000001,Vente,30000,,,LE GRAND BOUT,B141,88390,88201,Girancourt,88,,,882010000B0791,,,,,,,,,,,,,0,,,,,S,sols,,,987,6.315076,48.157563
2021-1513049,2021-12-20,000001,Vente,30000,,,LE GRAND BOUT,B141,88390,88201,Girancourt,88,,,882010000B0792,,,,,,,,,,,,,0,,,,,J,jardins,,,280,6.315224,48.15734
2021-1513049,2021-12-20,000001,Vente,30000,,,LE GRAND BOUT,B141,88390,88201,Girancourt,88,,,882010000B2382,,,,,,,,,,,,,0,,,,,P,prés,,,25,6.314942,48.157834
2021-1513049,2021-12-20,000001,Vente,30000,,,LE GRAND BOUT,B141,88390,88201,Girancourt,88,,,882010000B2384,,,,,,,,,,,,,0,,,,,P,prés,,,1144,6.314852,48.157415
2021-1513049,2021-12-20,000001,Vente,30000,,,LE GRAND BOUT,B141,88390,88201,Girancourt,88,,,882010000B2386,,,,,,,,,,,,,0,,,,,P,prés,,,260,6.314922,48.157665
2021-1513268,2021-12-17,000001,Vente,754.65,,,LES PETITS PARTAGES,B224,88390,88201,Girancourt,88,,,882010000B1962,,,,,,,,,,,,,0,,,,,BT,taillis simples,,,2516,,
2021-1513268,2021-12-17,000001,Vente,754.65,,,LES PETITS PARTAGES,B224,88390,88201,Girancourt,88,,,882010000B2012,,,,,,,,,,,,,0,,,,,BT,taillis simples,,,2515,,
2021-1513376,2021-12-21,000001,Vente,20000,967,,RUE DE LA GARE,0025,88390,88201,Girancourt,88,,,88201000ZA0052,,,,,,,,,,,,,0,1,Maison,72,3,S,sols,,,172,6.302325,48.173104
2021-1513393,2021-12-28,000001,Vente,52800,,,LE PORT,B234,88390,88201,Girancourt,88,,,88201000ZA0228,,,,,,,,,,,,,0,,,,,P,prés,,,1202,6.30238,48.168941
2021-1513407,2021-12-27,000001,Vente,243000,101,,COTE DES MOISES,B323,88390,88201,Girancourt,88,,,882010000B2302,,,,,,,,,,,,,0,1,Maison,108,5,S,sols,,,500,6.320867,48.152183
2021-1513407,2021-12-27,000001,Vente,243000,101,,COTE DES MOISES,B323,88390,88201,Girancourt,88,,,882010000B2302,,,,,,,,,,,,,0,1,Maison,108,5,P,prés,,,1950,6.320867,48.152183
2021-1513407,2021-12-27,000001,Vente,243000,101,,COTE DES MOISES,B323,88390,88201,Girancourt,88,,,882010000B2302,,,,,,,,,,,,,0,3,Dépendance,,0,P,prés,,,1950,6.320867,48.152183
2021-1513407,2021-12-27,000001,Vente,243000,101,,COTE DES MOISES,B323,88390,88201,Girancourt,88,,,882010000B2302,,,,,,,,,,,,,0,3,Dépendance,,0,S,sols,,,500,6.320867,48.152183
2021-1513496,2021-12-17,000001,Vente,115000,,,LES GRANDS MEIX,B154,88390,88201,Girancourt,88,,,882010000B0927,,,,,,,,,,,,,0,,,,,VE,vergers,,,2052,,
2021-1513496,2021-12-17,000001,Vente,115000,,,LES GRANDS MEIX,B154,88390,88201,Girancourt,88,,,882010000B0928,,,,,,,,,,,,,0,,,,,J,jardins,,,233,,
2021-1513496,2021-12-17,000001,Vente,115000,,,LES GRANDS MEIX,B154,88390,88201,Girancourt,88,,,882010000B2023,,,,,,,,,,,,,0,,,,,VE,vergers,,,1355,6.313193,48.160394
2021-1513496,2021-12-17,000001,Vente,115000,565,,RUE DE XERTIGNY,0047,88390,88201,Girancourt,88,,,882010000B2060,,,,,,,,,,,,,0,1,Maison,95,6,S,sols,,,415,,
2021-1513496,2021-12-17,000001,Vente,115000,,,LES GRANDS MEIX,B154,88390,88201,Girancourt,88,,,882010000B2371,,,,,,,,,,,,,0,,,,,J,jardins,,,349,,
