id_mutation,date_mutation,numero_disposition,nature_mutation,valeur_fonciere,adresse_numero,adresse_suffixe,adresse_nom_voie,adresse_code_voie,code_postal,code_commune,nom_commune,code_departement,ancien_code_commune,ancien_nom_commune,id_parcelle,ancien_id_parcelle,numero_volume,lot1_numero,lot1_surface_carrez,lot2_numero,lot2_surface_carrez,lot3_numero,lot3_surface_carrez,lot4_numero,lot4_surface_carrez,lot5_numero,lot5_surface_carrez,nombre_lots,code_type_local,type_local,surface_reelle_bati,nombre_pieces_principales,code_nature_culture,nature_culture,code_nature_culture_speciale,nature_culture_speciale,surface_terrain,longitude,latitude
2021-1505695,2021-01-14,000001,Vente,20000,,,PRE BREUIL,B144,88170,88241,Houécourt,88,,,88241000ZH0023,,,,,,,,,,,,,0,,,,,P,prés,,,631,5.890551,48.295578
2021-1505695,2021-01-14,000001,Vente,20000,116,B,RUE DIVISION LECLERC,0035,88170,88241,Houécourt,88,,,88241000ZI0073,,,,,,,,,,,,,0,4,Local industriel. commercial ou assimilé,2250,0,S,sols,,,5934,5.890956,48.295972
2021-1505981,2021-01-26,000001,Vente,210000,648,,RUE DIVISION LECLERC,0035,88170,88241,Houécourt,88,,,88241000ZK0003,,,,,,,,,,,,,0,1,Maison,235,5,VE,vergers,,,901,5.898157,48.298111
2021-1505981,2021-01-26,000001,Vente,210000,648,,RUE DIVISION LECLERC,0035,88170,88241,Houécourt,88,,,88241000ZK0003,,,,,,,,,,,,,0,1,Maison,235,5,J,jardins,,,901,5.898157,48.298111
2021-1505981,2021-01-26,000001,Vente,210000,648,,RUE DIVISION LECLERC,0035,88170,88241,Houécourt,88,,,88241000ZK0003,,,,,,,,,,,,,0,1,Maison,235,5,S,sols,,,500,5.898157,48.298111
2021-1506426,2021-02-26,000001,Vente,126000,133,,RUE DES ARBURES,0005,88170,88241,Houécourt,88,,,88241000ZD0054,,,,,,,,,,,,,0,1,Maison,90,4,P,prés,,,641,5.901342,48.300507
2021-1506426,2021-02-26,000001,Vente,126000,133,,RUE DES ARBURES,0005,88170,88241,Houécourt,88,,,88241000ZD0054,,,,,,,,,,,,,0,1,Maison,90,4,S,sols,,,500,5.901342,48.300507
2021-1506712,2021-03-31,000001,Vente,142000,217,,RUE DIVISION LECLERC,0035,88170,88241,Houécourt,88,,,88241000ZI0098,,,,,,,,,,,,,0,2,Appartement,79,3,S,sols,,,379,5.892116,48.297379
2021-1506712,2021-03-31,000001,Vente,142000,217,,RUE DIVISION LECLERC,0035,88170,88241,Houécourt,88,,,88241000ZI0098,,,,,,,,,,,,,0,2,Appartement,71,3,S,sols,,,379,5.892116,48.297379
2021-1506712,2021-03-31,000001,Vente,142000,217,,RUE DIVISION LECLERC,0035,88170,88241,Houécourt,88,,,88241000ZI0098,,,,,,,,,,,,,0,2,Appartement,79,3,S,sols,,,379,5.892116,48.297379
2021-1507132,2021-04-14,000001,Vente,2000,113,,RUE JEANNE D ARC,0100,88170,88241,Houécourt,88,,,88241000ZI0223,,,,,,,,,,,,,0,3,Dépendance,,0,S,sols,,,23,5.89569,48.297023
2021-1507713,2021-05-29,000001,Vente,17700,,,TEMPONEAU,B111,88170,88241,Houécourt,88,,,88241000ZE0028,,,,,,,,,,,,,0,,,,,P,prés,,,41622,5.887544,48.306228
2021-1507713,2021-05-29,000001,Vente,17700,,,TEMPONEAU,B111,88170,88241,Houécourt,88,,,88241000ZE0029,,,,,,,,,,,,,0,,,,,P,prés,,,4906,5.888658,48.305384
2021-1508088,2021-06-25,000001,Vente,8000,75,,RUE JEANNE D ARC,0100,88170,88241,Houécourt,88,,,88241000ZI0217,,,,,,,,,,,,,0,1,Maison,62,2,S,sols,,,194,5.895392,48.297226
2021-1508546,2021-07-13,000001,Vente,4000,83,,RUE JEANNE D ARC,0100,88170,88241,Houécourt,88,,,88241000ZI0220,,,,,,,,,,,,,0,1,Maison,52,2,S,sols,,,134,5.89553,48.297176
2021-1508917,2021-07-13,000001,Vente,1350,,,MOREMA,B070,88170,88241,Houécourt,88,,,882410000B0270,,,,,,,,,,,,,0,,,,,BT,taillis simples,,,1054,5.917886,48.290837
2021-1508917,2021-07-13,000001,Vente,1350,,,MOREMA,B070,88170,88241,Houécourt,88,,,882410000B0271,,,,,,,,,,,,,0,,,,,BR,futaies résineuses,,,2107,5.917935,48.290678
2021-1508920,2021-07-30,000001,Vente,2800,,,LES RIAUX,B102,88170,88241,Houécourt,88,,,88241000ZM0015,,,,,,,,,,,,,0,,,,,P,prés,,,3382,5.901831,48.28939
2021-1508920,2021-07-30,000001,Vente,2800,,,LES RIAUX,B102,88170,88241,Houécourt,88,,,88241000ZM0016,,,,,,,,,,,,,0,,,,,BP,peupleraies,,,2000,5.901797,48.288981
2021-1508920,2021-07-30,000001,Vente,2800,,,LES RIAUX,B102,88170,88241,Houécourt,88,,,88241000ZM0016,,,,,,,,,,,,,0,,,,,P,prés,,,2538,5.901797,48.288981
2021-1508920,2021-07-30,000001,Vente,2800,,,LES RIAUX,B102,88170,88241,Houécourt,88,,,88241000ZM0016,,,,,,,,,,,,,0,,,,,VE,vergers,,,2000,5.901797,48.288981
2021-1509420,2021-08-06,000001,Vente,8958.66,,,PRE GILBERT,B087,88170,88241,Houécourt,88,,,88241000ZH0028,,,,,,,,,,,,,0,,,,,P,prés,,,11277,5.896247,48.296049
2021-1509420,2021-08-06,000001,Vente,8958.66,,,LES VOSGES,B131,88170,88241,Houécourt,88,,,88241000ZI0043,,,,,,,,,,,,,0,,,,,P,prés,,,15072,5.895164,48.296657
2021-1509651,2021-09-10,000001,Vente,300,,,DEYSI,B129,88170,88241,Houécourt,88,,,88241000ZL0010,,,,,,,,,,,,,0,,,,,VE,vergers,,,2242,5.909855,48.295001
2021-1510484,2021-09-29,000001,Vente,59400,,,LES VOSGES,B131,88170,88241,Houécourt,88,,,88241000ZI0053,,,,,,,,,,,,,0,,,,,S,sols,,,143,5.89417,48.297443
2021-1510484,2021-09-29,000001,Vente,59400,340,,RUE DIVISION LECLERC,0035,88170,88241,Houécourt,88,,,88241000ZI0057,,,,,,,,,,,,,0,1,Maison,110,4,P,prés,,,1063,5.894043,48.297207
2021-1510484,2021-09-29,000001,Vente,59400,340,,RUE DIVISION LECLERC,0035,88170,88241,Houécourt,88,,,88241000ZI0057,,,,,,,,,,,,,0,1,Maison,110,4,S,sols,,,500,5.894043,48.297207
2021-1511359,2021-10-25,000001,Vente,8450,,,PRE GILBERT,B087,88170,88241,Houécourt,88,,,88241000ZH0029,,,,,,,,,,,,,0,,,,,J,jardins,,,250,5.896412,48.296505
2021-1511359,2021-10-25,000001,Vente,8450,,,PRE GILBERT,B087,88170,88241,Houécourt,88,,,88241000ZH0031,,,,,,,,,,,,,0,,,,,J,jardins,,,153,5.896672,48.296395
2021-1511359,2021-10-25,000001,Vente,8450,101,,RUE DE FONTENY,0080,88170,88241,Houécourt,88,,,88241000ZI0226,,,,,,,,,,,,,0,1,Maison,75,3,S,sols,,,123,5.896131,48.296945
2021-1511470,2021-10-30,000001,Vente,45000,41,,RUE DE LA POSTE,0180,88170,88241,Houécourt,88,,,88241000ZI0190,,,,,,,,,,,,,0,3,Dépendance,,0,S,sols,,,364,5.893388,48.297702
2021-1511470,2021-10-30,000001,Vente,45000,41,,RUE DE LA POSTE,0180,88170,88241,Houécourt,88,,,88241000ZI0190,,,,,,,,,,,,,0,3,Dépendance,,0,S,sols,,,364,5.893388,48.297702
2021-1511470,2021-10-30,000001,Vente,45000,41,,RUE DE LA POSTE,0180,88170,88241,Houécourt,88,,,88241000ZI0190,,,,,,,,,,,,,0,2,Appartement,100,3,S,sols,,,364,5.893388,48.297702
2021-1511470,2021-10-30,000001,Vente,45000,41,,RUE DE LA POSTE,0180,88170,88241,Houécourt,88,,,88241000ZI0190,,,,,,,,,,,,,0,4,Local industriel. commercial ou assimilé,137,0,S,sols,,,364,5.893388,48.297702
2021-1512415,2021-11-22,000001,Vente,600,,,LA BERGERIE,B133,88170,88241,Houécourt,88,,,88241000ZI0091,,,,,,,,,,,,,0,,,,,P,prés,,,912,5.891836,48.298058
2021-1512706,2021-12-02,000001,Vente,30000,,,LE HAUT DES ARBURES,B059,88170,88241,Houécourt,88,,,88241000ZD0033,,,,,,,,,,,,,0,,,,,P,prés,,,5955,,
2021-1512795,2021-12-06,000001,Vente,50000,,,LE BAS DES ARBURES,B004,88170,88241,Houécourt,88,,,88241000ZD0016,,,,,,,,,,,,,0,,,,,P,prés,,,58053,5.895848,48.301564
2021-1512795,2021-12-06,000001,Vente,50000,,,LE BAS DES ARBURES,B004,88170,88241,Houécourt,88,,,88241000ZD0016,,,,,,,,,,,,,0,,,,,P,prés,,,29026,5.895848,48.301564
2021-1512795,2021-12-06,000001,Vente,50000,,,LE BAS DES ARBURES,B004,88170,88241,Houécourt,88,,,88241000ZD0061,,,,,,,,,,,,,0,,,,,P,prés,,,9101,5.899639,48.302439
2021-1513414,2021-12-24,000001,Vente,2500,,,GRANDE CORVEE,B047,88170,88241,Houécourt,88,,,88241000ZL0090,,,,,,,,,,,,,0,,,,,L,landes,FRICH,Friche,1000,5.911697,48.29509
2021-1513414,2021-12-24,000001,Vente,2500,,,GRANDE CORVEE,B047,88170,88241,Houécourt,88,,,88241000ZL0090,,,,,,,,,,,,,0,,,,,VE,vergers,,,3939,5.911697,48.29509
2021-1513414,2021-12-24,000001,Vente,2500,,,GRANDE CORVEE,B047,88170,88241,Houécourt,88,,,88241000ZL0090,,,,,,,,,,,,,0,,,,,T,terres,,,3938,5.911697,48.29509
