id_mutation,date_mutation,numero_disposition,nature_mutation,valeur_fonciere,adresse_numero,adresse_suffixe,adresse_nom_voie,adresse_code_voie,code_postal,code_commune,nom_commune,code_departement,ancien_code_commune,ancien_nom_commune,id_parcelle,ancien_id_parcelle,numero_volume,lot1_numero,lot1_surface_carrez,lot2_numero,lot2_surface_carrez,lot3_numero,lot3_surface_carrez,lot4_numero,lot4_surface_carrez,lot5_numero,lot5_surface_carrez,nombre_lots,code_type_local,type_local,surface_reelle_bati,nombre_pieces_principales,code_nature_culture,nature_culture,code_nature_culture_speciale,nature_culture_speciale,surface_terrain,longitude,latitude
2021-1507223,2021-04-10,000001,Vente,154100,1,,RTE DE CHATILLON,0015,88800,88332,Norroy,88,,,883320000C0921,,,,,,,,,,,,,0,1,Maison,114,6,S,sols,,,1219,5.920676,48.214091
2021-1507223,2021-04-10,000001,Vente,154100,,,SOUS LES JARDINS DE LA FOL,B190,88800,88332,Norroy,88,,,883320000C0925,,,,,,,,,,,,,0,,,,,VE,vergers,,,1156,5.920755,48.213919
2021-1507974,2021-06-17,000001,Vente,440,,,DERRIERE CHATILLON,B046,88800,88332,Norroy,88,,,883320000B0545,,,,,,,,,,,,,0,,,,,T,terres,,,612,5.919409,48.201526
2021-1507974,2021-06-17,000001,Vente,440,,,LA CREUSE,B040,88800,88332,Norroy,88,,,88332000ZB0072,,,,,,,,,,,,,0,,,,,VE,vergers,,,832,5.922709,48.209597
2021-1508387,2021-07-01,000001,Vente,152461.94,,,JARDIN DROUOT,B107,88800,88332,Norroy,88,,,883320000C0217,,,,,,,,,,,,,0,,,,,VE,vergers,,,817,5.92273,48.215337
2021-1508387,2021-07-01,000001,Vente,152461.94,,,JARDIN DE LA FOLIE,B106,88800,88332,Norroy,88,,,883320000C0227,,,,,,,,,,,,,0,,,,,VE,vergers,,,3192,5.921379,48.212925
2021-1508387,2021-07-01,000001,Vente,152461.94,,,LA MAIX,B110,88800,88332,Norroy,88,,,88332000ZA0017,,,,,,,,,,,,,0,,,,,T,terres,,,57656,5.923543,48.218514
2021-1508387,2021-07-01,000001,Vente,152461.94,,,LA PIERRE,B211,88800,88332,Norroy,88,,,88332000ZA0073,,,,,,,,,,,,,0,,,,,T,terres,,,19114,5.912813,48.228802
2021-1508387,2021-07-01,000001,Vente,152461.94,,,LA CROISETTE,B042,88800,88332,Norroy,88,,,88332000ZB0086,,,,,,,,,,,,,0,,,,,P,prés,,,41509,5.920939,48.21022
2021-1508387,2021-07-01,000001,Vente,152461.94,,,LES GRANDES PORTIONS,B086,88800,88332,Norroy,88,,,88332000ZC0088,,,,,,,,,,,,,0,,,,,T,terres,,,72979,5.907058,48.21393
2021-1508387,2021-07-01,000001,Vente,152461.94,,,LE PARC,B128,88800,88332,Norroy,88,,,88332000ZD0013,,,,,,,,,,,,,0,,,,,T,terres,,,46924,5.90943,48.210853
2021-1511054,2021-10-12,000001,Vente,52800,,,LA GISSIERE,B072,88800,88332,Norroy,88,,,88332000ZB0103,,,,,,,,,,,,,0,,,,,T,terres,,,60520,,
2021-1511054,2021-10-12,000001,Vente,52800,,,LA GISSIERE,B072,88800,88332,Norroy,88,,,88332000ZB0103,,,,,,,,,,,,,0,,,,,VE,vergers,,,19994,,
2021-1511054,2021-10-12,000001,Vente,52800,,,LA GISSIERE,B072,88800,88332,Norroy,88,,,88332000ZB0103,,,,,,,,,,,,,0,,,,,T,terres,,,40000,,
2021-1511122,2021-10-12,000001,Vente,74500,4,,RTE DE MANDRES,0060,88800,88332,Norroy,88,,,883320000C1009,,,,,,,,,,,,,0,1,Maison,99,5,S,sols,,,517,5.916741,48.216197
2021-1511122,2021-10-12,000001,Vente,74500,,,LE VILLAGE,B203,88800,88332,Norroy,88,,,883320000C1011,,,,,,,,,,,,,0,,,,,AB,terrains a bâtir,,,51,5.916581,48.216263
2021-1511122,2021-10-12,000001,Vente,74500,,,LE VILLAGE,B203,88800,88332,Norroy,88,,,883320000C1013,,,,,,,,,,,,,0,,,,,AB,terrains a bâtir,,,53,5.916716,48.216321
2021-1511122,2021-10-12,000001,Vente,74500,,,LA QUARELLE,B169,88800,88332,Norroy,88,,,88332000ZC0021,,,,,,,,,,,,,0,,,,,T,terres,,,543,5.916988,48.21631
2021-1513139,2021-12-29,000001,Vente,34000,,,LE VILLAGE,B203,88800,88332,Norroy,88,,,883320000C0132,,,,,,,,,,,,,0,,,,,VE,vergers,,,550,5.919809,48.215082
2021-1513139,2021-12-29,000001,Vente,34000,,,LE VILLAGE,B203,88800,88332,Norroy,88,,,883320000C0133,,,,,,,,,,,,,0,,,,,T,terres,,,110,5.920008,48.214958
2021-1513139,2021-12-29,000001,Vente,34000,,,LE VILLAGE,B203,88800,88332,Norroy,88,,,883320000C0134,,,,,,,,,,,,,0,,,,,J,jardins,,,365,5.919932,48.215146
2021-1513139,2021-12-29,000001,Vente,34000,,,LE VILLAGE,B203,88800,88332,Norroy,88,,,883320000C0145,,,,,,,,,,,,,0,,,,,P,prés,,,1538,5.92027,48.215245
2021-1513139,2021-12-29,000001,Vente,34000,10,,RUE ST GEORGES,0085,88800,88332,Norroy,88,,,883320000C0146,,,,,,,,,,,,,0,1,Maison,96,4,S,sols,,,620,5.920589,48.215202
