id_mutation,date_mutation,numero_disposition,nature_mutation,valeur_fonciere,adresse_numero,adresse_suffixe,adresse_nom_voie,adresse_code_voie,code_postal,code_commune,nom_commune,code_departement,ancien_code_commune,ancien_nom_commune,id_parcelle,ancien_id_parcelle,numero_volume,lot1_numero,lot1_surface_carrez,lot2_numero,lot2_surface_carrez,lot3_numero,lot3_surface_carrez,lot4_numero,lot4_surface_carrez,lot5_numero,lot5_surface_carrez,nombre_lots,code_type_local,type_local,surface_reelle_bati,nombre_pieces_principales,code_nature_culture,nature_culture,code_nature_culture_speciale,nature_culture_speciale,surface_terrain,longitude,latitude
2021-1506460,2021-02-26,000001,Vente,52409.4,,,GRAND COROT,B041,88270,88347,Pierrefitte,88,,,88347000ZE0006,,,,,,,,,,,,,0,,,,,T,terres,,,13333,6.170007,48.175802
2021-1506460,2021-02-26,000001,Vente,52409.4,,,GRAND COROT,B041,88270,88347,Pierrefitte,88,,,88347000ZE0051,,,,,,,,,,,,,0,,,,,L,landes,FRICH,Friche,3110,6.164845,48.1794
2021-1506460,2021-02-26,000001,Vente,52409.4,,,LE COROT,B026,88270,88347,Pierrefitte,88,,,88347000ZH0017,,,,,,,,,,,,,0,,,,,T,terres,,,70906,6.169818,48.179605
2021-1507401,2021-04-30,000001,Vente,4000,,,AU VOID DE LERRAIN NORD,B090,88270,88347,Pierrefitte,88,,,883470000A0446,,,,,,,,,,,,,0,,,,,BT,taillis simples,,,1590,6.17468,48.161066
2021-1507401,2021-04-30,000001,Vente,4000,,,AU VOID DE LERRAIN NORD,B090,88270,88347,Pierrefitte,88,,,883470000A0449,,,,,,,,,,,,,0,,,,,BT,taillis simples,,,574,6.175069,48.160916
2021-1507401,2021-04-30,000001,Vente,4000,,,AU VOID DE LERRAIN NORD,B090,88270,88347,Pierrefitte,88,,,883470000A0451,,,,,,,,,,,,,0,,,,,BT,taillis simples,,,2655,6.175393,48.16083
2021-1507401,2021-04-30,000001,Vente,4000,,,AU VOID DE LERRAIN NORD,B090,88270,88347,Pierrefitte,88,,,883470000A0452,,,,,,,,,,,,,0,,,,,BT,taillis simples,,,1240,6.17565,48.160793
2021-1507401,2021-04-30,000001,Vente,4000,,,AU VOID DE LERRAIN NORD,B090,88270,88347,Pierrefitte,88,,,883470000A0453,,,,,,,,,,,,,0,,,,,BT,taillis simples,,,1335,6.175762,48.160778
2021-1507401,2021-04-30,000001,Vente,4000,,,AU VOID DE LERRAIN NORD,B090,88270,88347,Pierrefitte,88,,,883470000A0455,,,,,,,,,,,,,0,,,,,BT,taillis simples,,,4390,6.176251,48.159724
2021-1507401,2021-04-30,000001,Vente,4000,,,AU VOID DE LERRAIN NORD,B090,88270,88347,Pierrefitte,88,,,883470000A0456,,,,,,,,,,,,,0,,,,,BT,taillis simples,,,1860,6.17635,48.159924
2021-1507401,2021-04-30,000001,Vente,4000,,,AU VOID DE LERRAIN NORD,B090,88270,88347,Pierrefitte,88,,,883470000A0457,,,,,,,,,,,,,0,,,,,BT,taillis simples,,,1555,6.176367,48.160077
2021-1507401,2021-04-30,000001,Vente,4000,,,AU VOID DE LERRAIN NORD,B090,88270,88347,Pierrefitte,88,,,883470000A0458,,,,,,,,,,,,,0,,,,,BT,taillis simples,,,1360,6.176256,48.16026
2021-1507401,2021-04-30,000001,Vente,4000,,,AU VOID DE LERRAIN NORD,B090,88270,88347,Pierrefitte,88,,,883470000A0459,,,,,,,,,,,,,0,,,,,BT,taillis simples,,,420,6.177111,48.159741
2021-1507401,2021-04-30,000001,Vente,4000,,,AU VOID DE LERRAIN NORD,B090,88270,88347,Pierrefitte,88,,,883470000A0461,,,,,,,,,,,,,0,,,,,BT,taillis simples,,,1025,6.176598,48.160338
2021-1507401,2021-04-30,000001,Vente,4000,,,AU VOID DE LERRAIN NORD,B090,88270,88347,Pierrefitte,88,,,883470000A0467,,,,,,,,,,,,,0,,,,,BT,taillis simples,,,1480,6.177291,48.16061
2021-1507401,2021-04-30,000001,Vente,4000,,,AU VOID DE LERRAIN NORD,B090,88270,88347,Pierrefitte,88,,,883470000A0468,,,,,,,,,,,,,0,,,,,BT,taillis simples,,,900,6.177541,48.160683
2021-1507607,2021-05-11,000001,Vente,900,,,LE PIRONELLE,B055,88270,88347,Pierrefitte,88,,,883470000A0376,,,,,,,,,,,,,0,,,,,BT,taillis simples,,,3580,6.177636,48.149264
2021-1509114,2021-07-20,000001,Vente,25700,,,TRANCHEE D ESCLES,B082,88270,88347,Pierrefitte,88,,,883470000B1000,,,,,,,,,,,,,0,,,,,BT,taillis simples,,,4510,6.178772,48.148928
2021-1509208,2021-07-29,000001,Vente,103500,178,,RUE DE LA FOSSE,0008,88270,88347,Pierrefitte,88,,,88347000ZA0153,,,,,,,,,,,,,0,1,Maison,82,5,S,sols,,,1500,6.178872,48.168874
2021-1509208,2021-07-29,000001,Vente,103500,178,,RUE DE LA FOSSE,0008,88270,88347,Pierrefitte,88,,,88347000ZA0153,,,,,,,,,,,,,0,3,Dépendance,,0,S,sols,,,1500,6.178872,48.168874
2021-1509208,2021-07-29,000001,Vente,103500,178,,RUE DE LA FOSSE,0008,88270,88347,Pierrefitte,88,,,88347000ZA0153,,,,,,,,,,,,,0,3,Dépendance,,0,VE,vergers,,,547,6.178872,48.168874
2021-1509208,2021-07-29,000001,Vente,103500,178,,RUE DE LA FOSSE,0008,88270,88347,Pierrefitte,88,,,88347000ZA0153,,,,,,,,,,,,,0,1,Maison,82,5,VE,vergers,,,547,6.178872,48.168874
2021-1509208,2021-07-29,000001,Vente,103500,,,LE VILLAGE,B086,88270,88347,Pierrefitte,88,,,88347000ZA0156,,,,,,,,,,,,,0,,,,,P,prés,,,79,6.179047,48.168652
2021-1513478,2021-12-23,000001,Vente,131000,24,,GRANDE VOYE,B043,88270,88347,Pierrefitte,88,,,88347000ZA0022,,,,,,,,,,,,,0,1,Maison,160,5,S,sols,,,686,6.177402,48.167959
2021-1513478,2021-12-23,000001,Vente,131000,,,LE VILLAGE,B086,88270,88347,Pierrefitte,88,,,88347000ZA0084,,,,,,,,,,,,,0,,,,,VE,vergers,,,307,6.177135,48.167727
