id_mutation,date_mutation,numero_disposition,nature_mutation,valeur_fonciere,adresse_numero,adresse_suffixe,adresse_nom_voie,adresse_code_voie,code_postal,code_commune,nom_commune,code_departement,ancien_code_commune,ancien_nom_commune,id_parcelle,ancien_id_parcelle,numero_volume,lot1_numero,lot1_surface_carrez,lot2_numero,lot2_surface_carrez,lot3_numero,lot3_surface_carrez,lot4_numero,lot4_surface_carrez,lot5_numero,lot5_surface_carrez,nombre_lots,code_type_local,type_local,surface_reelle_bati,nombre_pieces_principales,code_nature_culture,nature_culture,code_nature_culture_speciale,nature_culture_speciale,surface_terrain,longitude,latitude
2021-1505702,2021-01-21,000001,Vente,50000,5029,,RUE DU CHAMP BOURGON,0060,88170,88431,Saint-Paul,88,,,88431000ZC0184,,,,,,,,,,,,,0,3,Dépendance,,0,S,sols,,,901,5.889909,48.328931
2021-1505702,2021-01-21,000001,Vente,50000,,,LE VILLAGE,B114,88170,88431,Saint-Paul,88,,,88431000ZC0185,,,,,,,,,,,,,0,,,,,J,jardins,,,449,5.890145,48.329108
2021-1505702,2021-01-21,000001,Vente,50000,,,LE VILLAGE,B114,88170,88431,Saint-Paul,88,,,88431000ZC0186,,,,,,,,,,,,,0,,,,,J,jardins,,,45,5.890139,48.329195
2021-1505702,2021-01-21,000001,Vente,50000,25,,RUE DU CHAMP BOURGON,0060,88170,88431,Saint-Paul,88,,,88431000ZC0189,,,,,,,,,,,,,0,2,Appartement,69,3,S,sols,,,898,5.889629,48.329012
2021-1505702,2021-01-21,000001,Vente,50000,25,,RUE DU CHAMP BOURGON,0060,88170,88431,Saint-Paul,88,,,88431000ZC0189,,,,,,,,,,,,,0,2,Appartement,63,2,S,sols,,,898,5.889629,48.329012
2021-1505702,2021-01-21,000001,Vente,50000,,,LE VILLAGE,B114,88170,88431,Saint-Paul,88,,,88431000ZC0229,,,,,,,,,,,,,0,,,,,VE,vergers,,,137,5.889585,48.329125
2021-1505702,2021-01-21,000001,Vente,50000,,,LE VILLAGE,B114,88170,88431,Saint-Paul,88,,,88431000ZC0231,,,,,,,,,,,,,0,,,,,S,sols,,,10,5.889501,48.328817
2021-1507467,2021-05-21,000001,Vente,166000,,,A LA RUE,B092,88170,88431,Saint-Paul,88,,,88431000ZD0053,,,,,,,,,,,,,0,,,,,AB,terrains a bâtir,,,1099,5.894337,48.329329
2021-1507467,2021-05-21,000001,Vente,166000,107,,LOT LES COURTILLOTTES,A001,88170,88431,Saint-Paul,88,,,88431000ZD0054,,,,,,,,,,,,,0,1,Maison,119,5,S,sols,,,731,5.894673,48.329525
2021-1507467,2021-05-21,000001,Vente,166000,,,A LA RUE,B092,88170,88431,Saint-Paul,88,,,88431000ZD0073,,,,,,,,,,,,,0,,,,,S,sols,,,1341,5.895004,48.329471
2021-1507719,2021-05-31,000001,Vente,2500,,,VIOFOSSET,B115,88170,88431,Saint-Paul,88,,,88431000ZB0053,,,,,,,,,,,,,0,,,,,BS,taillis sous futaie,,,4440,5.874024,48.337488
2021-1507719,2021-05-31,000001,Vente,2500,,,FORTE TERRE,B125,88170,88431,Saint-Paul,88,,,88431000ZC0129,,,,,,,,,,,,,0,,,,,BP,peupleraies,,,1685,5.882678,48.328008
2021-1510061,2021-09-18,000001,Vente,65000,185,,RUE DES TILLEULS,0127,88170,88431,Saint-Paul,88,,,88431000ZE0012,,,,,,,,,,,,,0,1,Maison,75,3,S,sols,,,250,5.891522,48.328506
2021-1510083,2021-09-22,000001,Vente,82000,118,,RUE DU CHAMP BOURGON,0060,88170,88431,Saint-Paul,88,,,88431000ZC0078,,,,,,,,,,,,,0,3,Dépendance,,0,S,sols,,,1000,5.890353,48.328166
2021-1510083,2021-09-22,000001,Vente,82000,118,,RUE DU CHAMP BOURGON,0060,88170,88431,Saint-Paul,88,,,88431000ZC0078,,,,,,,,,,,,,0,1,Maison,105,4,S,sols,,,1000,5.890353,48.328166
2021-1510083,2021-09-22,000001,Vente,82000,118,,RUE DU CHAMP BOURGON,0060,88170,88431,Saint-Paul,88,,,88431000ZC0078,,,,,,,,,,,,,0,3,Dépendance,,0,VE,vergers,,,1576,5.890353,48.328166
2021-1510083,2021-09-22,000001,Vente,82000,118,,RUE DU CHAMP BOURGON,0060,88170,88431,Saint-Paul,88,,,88431000ZC0078,,,,,,,,,,,,,0,1,Maison,105,4,VE,vergers,,,1576,5.890353,48.328166
2021-1510353,2021-10-01,000001,Vente,70400,150,,RUE SOUS L ORME,0100,88170,88431,Saint-Paul,88,,,88431000ZC0165,,,,,,,,,,,,,0,1,Maison,70,3,S,sols,,,609,5.890236,48.329846
2021-1510626,2021-09-28,000001,Vente,100,,,FORTE TERRE,B125,88170,88431,Saint-Paul,88,,,88431000ZC0115,,,,,,,,,,,,,0,,,,,BT,taillis simples,,,980,5.878793,48.325568
2021-1511059,2021-10-28,000001,Vente,10000,,,LE CLOZEL,B017,88170,88431,Saint-Paul,88,,,88431000ZC0080,,,,,,,,,,,,,0,,,,,S,sols,,,800,5.890701,48.328114
