id_mutation,date_mutation,numero_disposition,nature_mutation,valeur_fonciere,adresse_numero,adresse_suffixe,adresse_nom_voie,adresse_code_voie,code_postal,code_commune,nom_commune,code_departement,ancien_code_commune,ancien_nom_commune,id_parcelle,ancien_id_parcelle,numero_volume,lot1_numero,lot1_surface_carrez,lot2_numero,lot2_surface_carrez,lot3_numero,lot3_surface_carrez,lot4_numero,lot4_surface_carrez,lot5_numero,lot5_surface_carrez,nombre_lots,code_type_local,type_local,surface_reelle_bati,nombre_pieces_principales,code_nature_culture,nature_culture,code_nature_culture_speciale,nature_culture_speciale,surface_terrain,longitude,latitude
2021-1505733,2021-01-21,000001,Vente,200,,,LA LONGUE CHAINE,B068,88330,88497,Vaxoncourt,88,,,884970000A0741,,,,,,,,,,,,,0,,,,,VE,vergers,,,1275,6.412567,48.306155
2021-1506094,2021-02-12,000001,Vente,148000,67,,RUE DE LA MOSELLE,0040,88330,88497,Vaxoncourt,88,,,884970000B1434,,,,,,,,,,,,,0,3,Dépendance,,0,S,sols,,,159,6.410523,48.291341
2021-1506094,2021-02-12,000001,Vente,148000,67,,RUE DE LA MOSELLE,0040,88330,88497,Vaxoncourt,88,,,884970000B1435,,,1,4.76,3,5.67,5,,,,,,3,2,Appartement,102,4,,,,,,6.410539,48.291271
2021-1506673,2021-03-23,000001,Vente,2000,,,LA ROTTE PARDON,B112,88330,88497,Vaxoncourt,88,,,884970000A0294,,,,,,,,,,,,,0,,,,,T,terres,,,1810,6.427958,48.299089
2021-1506673,2021-03-23,000001,Vente,2000,,,LA ROTTE PARDON,B112,88330,88497,Vaxoncourt,88,,,884970000A0295,,,,,,,,,,,,,0,,,,,T,terres,,,990,6.427857,48.298952
2021-1506673,2021-03-23,000001,Vente,2000,,,LA ROTTE PARDON,B112,88330,88497,Vaxoncourt,88,,,884970000A0296,,,,,,,,,,,,,0,,,,,T,terres,,,1100,6.427771,48.298937
2021-1506707,2021-03-22,000001,Vente,500,,,POINTIERES DU PATIS LE VOI,B094,88330,88497,Vaxoncourt,88,,,884970000A0501,,,,,,,,,,,,,0,,,,,L,landes,FRICH,Friche,585,6.417062,48.296576
2021-1506707,2021-03-22,000001,Vente,500,,,POINTIERES DU PATIS LE VOI,B094,88330,88497,Vaxoncourt,88,,,884970000A0506,,,,,,,,,,,,,0,,,,,L,landes,FRICH,Friche,920,6.416683,48.296609
2021-1506737,2021-03-19,000001,Vente,14000,,,LE VILLAGE,B120,88330,88497,Vaxoncourt,88,,,884970000B1731,,,,,,,,,,,,,0,,,,,S,sols,,,153,6.410966,48.292189
2021-1506873,2021-03-26,000001,Vente,188000,5,,CHE DES PAQUIS,0043,88330,88497,Vaxoncourt,88,,,884970000B0879,,,,,,,,,,,,,0,1,Maison,98,4,S,sols,,,725,6.409451,48.291749
2021-1506873,2021-03-26,000001,Vente,188000,5,,CHE DES PAQUIS,0043,88330,88497,Vaxoncourt,88,,,884970000B0879,,,,,,,,,,,,,0,4,Local industriel. commercial ou assimilé,40,0,S,sols,,,725,6.409451,48.291749
2021-1507267,2021-04-26,000001,Vente,500,,,AUPRES CHEM VERS BUISSON M,B002,88330,88497,Vaxoncourt,88,,,884970000B0511,,,,,,,,,,,,,0,,,,,T,terres,,,850,6.410793,48.284072
2021-1507299,2021-04-26,000001,Vente,164000,267,,RUE DERRIERE LA VILLE,0030,88330,88497,Vaxoncourt,88,,,884970000B1700,,,,,,,,,,,,,0,1,Maison,99,4,S,sols,,,223,6.411105,48.28986
2021-1507372,2021-04-29,000001,Vente,50000,92,,RUE DES PETITS SABOTS,0042,88330,88497,Vaxoncourt,88,,,884970000B0691,,,5,,6,133.09,7,,,,,,3,2,Appartement,66,2,,,,,,6.41093,48.292532
2021-1507584,2021-05-05,000001,Echange,500,,,GREVE JUSQU AUX CHENNEVIER,B061,88330,88497,Vaxoncourt,88,,,884970000B0777,,,,,,,,,,,,,0,,,,,T,terres,,,1110,6.410649,48.288437
2021-1507584,2021-05-05,000002,Echange,500,,,AUPRES CHEM VERS BUISSON M,B002,88330,88497,Vaxoncourt,88,,,884970000B0511,,,,,,,,,,,,,0,,,,,T,terres,,,850,6.410793,48.284072
2021-1507689,2021-05-26,000001,Vente,59000,,,POINTIERES AU DESSUS CONRA,B090,88330,88497,Vaxoncourt,88,,,884970000A1546,,,,,,,,,,,,,0,,,,,L,landes,FRICH,Friche,359,6.415741,48.298823
2021-1507689,2021-05-26,000001,Vente,59000,,,POINTIERES AU DESSUS CONRA,B090,88330,88497,Vaxoncourt,88,,,884970000A1548,,,,,,,,,,,,,0,,,,,T,terres,,,1056,6.415425,48.298684
2021-1507689,2021-05-26,000001,Vente,59000,454,,RTE DE CHATEL,0022,88330,88497,Vaxoncourt,88,,,884970000A1564,,,,,,,,,,,,,0,1,Maison,63,3,S,sols,,,432,6.415174,48.29857
2021-1508238,2021-06-29,000001,Vente,1990,,,POINTIERES AU DESSUS CONRA,B090,88330,88497,Vaxoncourt,88,,,884970000A0577,,,,,,,,,,,,,0,,,,,VE,vergers,,,430,6.414725,48.300307
2021-1508238,2021-06-29,000001,Vente,1990,,,POINTIERES AU DESSUS CONRA,B090,88330,88497,Vaxoncourt,88,,,884970000A0579,,,,,,,,,,,,,0,,,,,B,bois,AULN,Aulnaie,365,6.414427,48.300298
2021-1508238,2021-06-29,000001,Vente,1990,,,POINTIERES AU DESSUS CONRA,B090,88330,88497,Vaxoncourt,88,,,884970000A0602,,,,,,,,,,,,,0,,,,,L,landes,FRICH,Friche,815,6.4149,48.300456
2021-1508238,2021-06-29,000001,Vente,1990,,,POINTIERES AU DESSUS CONRA,B090,88330,88497,Vaxoncourt,88,,,884970000A0611,,,,,,,,,,,,,0,,,,,T,terres,,,805,6.414896,48.300909
2021-1508238,2021-06-29,000001,Vente,1990,,,POINTIERES AU DESSUS CONRA,B090,88330,88497,Vaxoncourt,88,,,884970000A0612,,,,,,,,,,,,,0,,,,,T,terres,,,1006,6.415109,48.300536
2021-1508238,2021-06-29,000001,Vente,1990,,,POINTIERES AU DESSUS CONRA,B090,88330,88497,Vaxoncourt,88,,,884970000A0613,,,,,,,,,,,,,0,,,,,T,terres,,,840,6.415208,48.30074
2021-1508238,2021-06-29,000001,Vente,1990,,,POINTIERES AU DESSUS CONRA,B090,88330,88497,Vaxoncourt,88,,,884970000A0615,,,,,,,,,,,,,0,,,,,T,terres,,,487,6.41529,48.300906
2021-1508673,2021-07-06,000001,Vente,800,,,LA LONGUE CHAINE,B068,88330,88497,Vaxoncourt,88,,,884970000A0782,,,,,,,,,,,,,0,,,,,VE,vergers,,,1145,6.415901,48.30522
2021-1508673,2021-07-06,000001,Vente,800,,,LA LONGUE CHAINE,B068,88330,88497,Vaxoncourt,88,,,884970000A0783,,,,,,,,,,,,,0,,,,,VE,vergers,,,595,6.416852,48.304442
2021-1508940,2021-07-16,000001,Vente,6500,,,LA ROTTE PARDON,B112,88330,88497,Vaxoncourt,88,,,884970000A0306,,,,,,,,,,,,,0,,,,,B,bois,AULN,Aulnaie,1270,6.425847,48.299075
2021-1508940,2021-07-16,000001,Vente,6500,,,POINTIERES DU RANG BASSIN,B095,88330,88497,Vaxoncourt,88,,,884970000A0355,,,,,,,,,,,,,0,,,,,B,bois,AULN,Aulnaie,2825,6.425796,48.296225
2021-1508940,2021-07-16,000001,Vente,6500,,,POINTIERES DU RANG BASSIN,B095,88330,88497,Vaxoncourt,88,,,884970000A0356,,,,,,,,,,,,,0,,,,,B,bois,AULN,Aulnaie,575,6.425426,48.296073
2021-1508940,2021-07-16,000001,Vente,6500,,,POINTIERES DU RANG BASSIN,B095,88330,88497,Vaxoncourt,88,,,884970000A0357,,,,,,,,,,,,,0,,,,,B,bois,AULN,Aulnaie,2880,6.424787,48.295874
2021-1508940,2021-07-16,000001,Vente,6500,,,POINTIERES DU RANG BASSIN,B095,88330,88497,Vaxoncourt,88,,,884970000A0359,,,,,,,,,,,,,0,,,,,B,bois,AULN,Aulnaie,1330,6.424083,48.294778
2021-1508940,2021-07-16,000001,Vente,6500,,,POINTIERES DU RANG BASSIN,B095,88330,88497,Vaxoncourt,88,,,884970000A0360,,,,,,,,,,,,,0,,,,,B,bois,AULN,Aulnaie,200,6.42375,48.294565
2021-1508940,2021-07-16,000001,Vente,6500,,,POINTIERES DU RANG BASSIN,B095,88330,88497,Vaxoncourt,88,,,884970000A0377,,,,,,,,,,,,,0,,,,,B,bois,AULN,Aulnaie,1890,6.426248,48.295673
2021-1508940,2021-07-16,000001,Vente,6500,,,POINTIERES DU RANG BASSIN,B095,88330,88497,Vaxoncourt,88,,,884970000A0378,,,,,,,,,,,,,0,,,,,B,bois,AULN,Aulnaie,2370,6.426074,48.295872
2021-1508940,2021-07-16,000001,Vente,6500,,,LES PRES CONRAUX,B103,88330,88497,Vaxoncourt,88,,,884970000A0544,,,,,,,,,,,,,0,,,,,P,prés,,,1035,6.412991,48.298996
2021-1508940,2021-07-16,000001,Vente,6500,,,LES PRES CONRAUX,B103,88330,88497,Vaxoncourt,88,,,884970000A0545,,,,,,,,,,,,,0,,,,,P,prés,,,480,6.412442,48.29893
2021-1508940,2021-07-16,000001,Vente,6500,,,LES PRES CONRAUX,B103,88330,88497,Vaxoncourt,88,,,884970000A0549,,,,,,,,,,,,,0,,,,,P,prés,,,1600,6.41332,48.299465
2021-1508940,2021-07-16,000001,Vente,6500,,,POINTIERES AU DESSUS CONRA,B090,88330,88497,Vaxoncourt,88,,,884970000A0591,,,,,,,,,,,,,0,,,,,T,terres,,,325,6.41284,48.301531
2021-1508940,2021-07-16,000001,Vente,6500,,,POINTIERES AU DESSUS CONRA,B090,88330,88497,Vaxoncourt,88,,,884970000A0592,,,,,,,,,,,,,0,,,,,B,bois,AULN,Aulnaie,923,6.413181,48.301271
2021-1508940,2021-07-16,000001,Vente,6500,,,POINTIERES AU DESSUS CONRA,B090,88330,88497,Vaxoncourt,88,,,884970000A0594,,,,,,,,,,,,,0,,,,,B,bois,AULN,Aulnaie,1965,6.413727,48.300966
2021-1508940,2021-07-16,000001,Vente,6500,,,POINTIERES AU DESSUS CONRA,B090,88330,88497,Vaxoncourt,88,,,884970000A0595,,,,,,,,,,,,,0,,,,,L,landes,FRICH,Friche,995,6.413801,48.301101
2021-1508940,2021-07-16,000001,Vente,6500,,,POIN ABOUTISSANT SUR VERSE,B076,88330,88497,Vaxoncourt,88,,,884970000A0658,,,,,,,,,,,,,0,,,,,B,bois,AULN,Aulnaie,1055,6.413397,48.302064
2021-1508940,2021-07-16,000001,Vente,6500,,,DSU CHEM VAUDON AU RANG TO,B043,88330,88497,Vaxoncourt,88,,,884970000B0345,,,,,,,,,,,,,0,,,,,T,terres,,,3260,6.404014,48.291266
2021-1508940,2021-07-16,000001,Vente,6500,,,DSU CHEM VAUDON AU RANG TO,B043,88330,88497,Vaxoncourt,88,,,884970000B0346,,,,,,,,,,,,,0,,,,,BR,futaies résineuses,,,720,6.402448,48.291173
2021-1508940,2021-07-16,000001,Vente,6500,,,DSU CHEM VAUDON AU RANG TO,B043,88330,88497,Vaxoncourt,88,,,884970000B0347,,,,,,,,,,,,,0,,,,,BR,futaies résineuses,,,430,6.402528,48.291081
2021-1508940,2021-07-16,000001,Vente,6500,,,BAS GREVE TIR SUR CHPS PRE,B006,88330,88497,Vaxoncourt,88,,,884970000B0841,,,,,,,,,,,,,0,,,,,VE,vergers,,,490,6.408586,48.290988
2021-1508940,2021-07-16,000001,Vente,6500,,,GRANDE POIN DU HAUT DU CHE,B060,88330,88497,Vaxoncourt,88,,,884970000B1227,,,,,,,,,,,,,0,,,,,T,terres,,,3180,6.418819,48.278529
2021-1509021,2021-08-06,000001,Vente,354500,,,CHAMPS DEVANT FOURCHES,B024,88330,88497,Vaxoncourt,88,,,884970000A1705,,,,,,,,,,,,,0,,,,,P,prés,,,178,6.419707,48.289424
2021-1509021,2021-08-06,000001,Vente,354500,,,CHAMPS DEVANT FOURCHES,B024,88330,88497,Vaxoncourt,88,,,884970000A1707,,,,,,,,,,,,,0,,,,,L,landes,FRICH,Friche,79,6.419698,48.289148
2021-1509021,2021-08-06,000001,Vente,354500,560,,CHE DU MOULIN,0058,88330,88497,Vaxoncourt,88,,,884970000A1709,,,,,,,,,,,,,0,1,Maison,167,3,S,sols,,,1000,6.419959,48.289506
2021-1509021,2021-08-06,000001,Vente,354500,560,,CHE DU MOULIN,0058,88330,88497,Vaxoncourt,88,,,884970000A1709,,,,,,,,,,,,,0,1,Maison,167,3,P,prés,,,1603,6.419959,48.289506
2021-1509277,2021-08-10,000001,Vente,15000,,,ENT POIROUSE ET POIN CERIS,B049,88330,88497,Vaxoncourt,88,,,884970000A0095,,,,,,,,,,,,,0,,,,,T,terres,,,825,6.418244,48.301417
2021-1509277,2021-08-10,000001,Vente,15000,,,POIN ABOUTISSANT SUR VERSE,B076,88330,88497,Vaxoncourt,88,,,884970000A0630,,,,,,,,,,,,,0,,,,,L,landes,FRICH,Friche,345,6.413084,48.303646
2021-1509277,2021-08-10,000001,Vente,15000,,,DEVANT LE BOIS BANNI,B042,88330,88497,Vaxoncourt,88,,,884970000A1083,,,,,,,,,,,,,0,,,,,T,terres,,,2330,6.427943,48.28294
2021-1509277,2021-08-10,000001,Vente,15000,,,DEVANT LE BOIS BANNI,B042,88330,88497,Vaxoncourt,88,,,884970000A1084,,,,,,,,,,,,,0,,,,,T,terres,,,2210,6.42774,48.282877
2021-1509277,2021-08-10,000001,Vente,15000,,,ENT PRES ETANGS ET ANCONGE,B050,88330,88497,Vaxoncourt,88,,,884970000A1165,,,,,,,,,,,,,0,,,,,P,prés,,,3070,6.420401,48.28722
2021-1509277,2021-08-10,000001,Vente,15000,,,LES ELIEUX,B046,88330,88497,Vaxoncourt,88,,,884970000A1286,,,,,,,,,,,,,0,,,,,T,terres,,,1275,6.413865,48.290356
2021-1509277,2021-08-10,000001,Vente,15000,,,LES ELIEUX,B046,88330,88497,Vaxoncourt,88,,,884970000A1293,,,,,,,,,,,,,0,,,,,T,terres,,,215,6.413131,48.290231
2021-1509277,2021-08-10,000001,Vente,15000,,,PETIEY,B074,88330,88497,Vaxoncourt,88,,,884970000A1296,,,,,,,,,,,,,0,,,,,T,terres,,,5360,6.414638,48.289816
2021-1509277,2021-08-10,000001,Vente,15000,,,PETIEY,B074,88330,88497,Vaxoncourt,88,,,884970000A1297,,,,,,,,,,,,,0,,,,,T,terres,,,920,6.414727,48.289589
2021-1509277,2021-08-10,000001,Vente,15000,,,PETIEY,B074,88330,88497,Vaxoncourt,88,,,884970000A1298,,,,,,,,,,,,,0,,,,,T,terres,,,1010,6.414871,48.289557
2021-1509277,2021-08-10,000001,Vente,15000,,,PETIEY,B074,88330,88497,Vaxoncourt,88,,,884970000A1299,,,,,,,,,,,,,0,,,,,T,terres,,,3311,6.41484,48.289411
2021-1509277,2021-08-10,000001,Vente,15000,,,CHPS DSO NOL BASSE MERCIER,B030,88330,88497,Vaxoncourt,88,,,884970000B0191,,,,,,,,,,,,,0,,,,,P,prés,,,1450,6.40955,48.298215
2021-1509277,2021-08-10,000001,Vente,15000,,,AU BOUT DU HAUT DE LA MAIX,B012,88330,88497,Vaxoncourt,88,,,884970000B0261,,,,,,,,,,,,,0,,,,,T,terres,,,852,6.403358,48.292742
2021-1509277,2021-08-10,000001,Vente,15000,,,DSU CHEM VAUDON AU RANG TO,B043,88330,88497,Vaxoncourt,88,,,884970000B0319,,,,,,,,,,,,,0,,,,,T,terres,,,682,6.404361,48.292052
2021-1509277,2021-08-10,000001,Vente,15000,,,DSU CHEM VAUDON AU RANG TO,B043,88330,88497,Vaxoncourt,88,,,884970000B0341,,,,,,,,,,,,,0,,,,,T,terres,,,540,6.402477,48.291379
2021-1509277,2021-08-10,000001,Vente,15000,,,LES PRES AU BAS DE LA COTE,B100,88330,88497,Vaxoncourt,88,,,884970000B0440,,,,,,,,,,,,,0,,,,,B,bois,AULN,Aulnaie,70,6.402713,48.288109
2021-1509277,2021-08-10,000001,Vente,15000,,,DSU GREVE JUSQUE SUR MOSEL,B044,88330,88497,Vaxoncourt,88,,,884970000B0482,,,,,,,,,,,,,0,,,,,T,terres,,,1090,6.408272,48.286285
2021-1509277,2021-08-10,000001,Vente,15000,,,BAS NOIR CROIX SUR CHEM EP,B007,88330,88497,Vaxoncourt,88,,,884970000B0523,,,,,,,,,,,,,0,,,,,T,terres,,,1690,6.412991,48.282077
2021-1509277,2021-08-10,000001,Vente,15000,,,LE BUISSON DE LA MAIRIE,B015,88330,88497,Vaxoncourt,88,,,884970000B0536,,,,,,,,,,,,,0,,,,,B,bois,AULN,Aulnaie,750,6.410085,48.28087
2021-1509277,2021-08-10,000001,Vente,15000,,,LE BUISSON DE LA MAIRIE,B015,88330,88497,Vaxoncourt,88,,,884970000B0561,,,,,,,,,,,,,0,,,,,T,terres,,,3500,6.408865,48.284278
2021-1509277,2021-08-10,000001,Vente,15000,,,ENTRE POIN DE CROIX ET COT,B054,88330,88497,Vaxoncourt,88,,,884970000B0576,,,,,,,,,,,,,0,,,,,T,terres,,,1110,6.408759,48.285346
2021-1509277,2021-08-10,000001,Vente,15000,,,ENTRE POIN DE CROIX ET COT,B054,88330,88497,Vaxoncourt,88,,,884970000B0584,,,,,,,,,,,,,0,,,,,T,terres,,,2950,6.407738,48.285149
2021-1509277,2021-08-10,000001,Vente,15000,,,LES MIEUTRYS,B071,88330,88497,Vaxoncourt,88,,,884970000B1022,,,,,,,,,,,,,0,,,,,T,terres,,,690,6.414149,48.284954
2021-1509277,2021-08-10,000001,Vente,15000,,,POINTIERES DE LA COULEUVRE,B091,88330,88497,Vaxoncourt,88,,,884970000B1051,,,,,,,,,,,,,0,,,,,T,terres,,,1135,6.413325,48.282656
2021-1509277,2021-08-10,000001,Vente,15000,,,POINTIERE DU HAUT DU CHENE,B087,88330,88497,Vaxoncourt,88,,,884970000B1116,,,,,,,,,,,,,0,,,,,T,terres,,,1520,6.417698,48.280884
2021-1509277,2021-08-10,000001,Vente,15000,,,GDES POIN ABOUT SUR BROUYN,B057,88330,88497,Vaxoncourt,88,,,884970000B1163,,,,,,,,,,,,,0,,,,,T,terres,,,1638,6.423884,48.281394
2021-1509277,2021-08-10,000001,Vente,15000,,,GDES POIN ABOUT SUR BROUYN,B057,88330,88497,Vaxoncourt,88,,,884970000B1171,,,,,,,,,,,,,0,,,,,T,terres,,,1680,6.422807,48.281261
2021-1509277,2021-08-10,000001,Vente,15000,,,BOUILLOT,B011,88330,88497,Vaxoncourt,88,,,884970000B1328,,,,,,,,,,,,,0,,,,,B,bois,AULN,Aulnaie,875,6.410579,48.280468
2021-1509277,2021-08-10,000001,Vente,15000,,,BOUILLOT,B011,88330,88497,Vaxoncourt,88,,,884970000B1329,,,,,,,,,,,,,0,,,,,B,bois,AULN,Aulnaie,1480,6.41097,48.280154
2021-1509277,2021-08-10,000001,Vente,15000,,,BOUILLOT,B011,88330,88497,Vaxoncourt,88,,,884970000B1331,,,,,,,,,,,,,0,,,,,P,prés,,,365,6.411028,48.279476
2021-1509277,2021-08-10,000001,Vente,15000,,,LA COTE DES BREBIS,B031,88330,88497,Vaxoncourt,88,,,884970000B1413,,,,,,,,,,,,,0,,,,,T,terres,,,1000,6.405892,48.287666
2021-1509563,2021-08-18,000001,Vente,95000,497,,CHE DU MOULIN,0058,88330,88497,Vaxoncourt,88,,,884970000A1752,,,,,,,,,,,,,0,1,Maison,140,4,S,sols,,,180,6.419278,48.289392
2021-1509563,2021-08-18,000001,Vente,95000,,,CHAMPS DEVANT FOURCHES,B024,88330,88497,Vaxoncourt,88,,,884970000A1754,,,,,,,,,,,,,0,,,,,AB,terrains a bâtir,,,190,6.41956,48.289344
2021-1509563,2021-08-18,000001,Vente,95000,,,CHAMPS DEVANT FOURCHES,B024,88330,88497,Vaxoncourt,88,,,884970000A1757,,,,,,,,,,,,,0,,,,,S,sols,,,1184,6.419567,48.289629
2021-1510422,2021-09-10,000001,Vente,27000,,,POINTIERE SUR LES FOSSES,B089,88330,88497,Vaxoncourt,88,,,884970000A1368,,,,,,,,,,,,,0,,,,,VE,vergers,,,1636,6.413842,48.288092
2021-1510429,2021-09-10,000001,Vente,155000,168,,GR GRANDE RUE,0080,88330,88497,Vaxoncourt,88,,,884970000B1689,,3,,,,,,,,,,,0,,,,,,,,,,6.411406,48.289813
2021-1510429,2021-09-10,000001,Vente,155000,,,LE VILLAGE,B120,88330,88497,Vaxoncourt,88,,,884970000B1689,,6,,,,,,,,,,,0,,,,,,,,,,6.411406,48.289813
2021-1510577,2021-09-15,000001,Vente,10065,,,POIN AIG CHEM MOR CHAT PAL,B077,88330,88497,Vaxoncourt,88,,,884970000A0135,,,,,,,,,,,,,0,,,,,VI,vignes,,,1854,6.422541,48.303366
2021-1510577,2021-09-15,000001,Vente,10065,,,POIN AIG CHEM MOR CHAT PAL,B077,88330,88497,Vaxoncourt,88,,,884970000A0135,,,,,,,,,,,,,0,,,,,VE,vergers,,,2366,6.422541,48.303366
2021-1510577,2021-09-15,000001,Vente,10065,,,POIN AIG CHEM MOR CHAT PAL,B077,88330,88497,Vaxoncourt,88,,,884970000A0136,,,,,,,,,,,,,0,,,,,T,terres,,,1200,6.422159,48.303563
2021-1510577,2021-09-15,000001,Vente,10065,,,POIN AIG CHEM MOR CHAT PAL,B077,88330,88497,Vaxoncourt,88,,,884970000A0137,,,,,,,,,,,,,0,,,,,T,terres,,,1200,6.421884,48.303625
2021-1510577,2021-09-15,000001,Vente,10065,,,POINTIERE DU HAUT DU CHENE,B087,88330,88497,Vaxoncourt,88,,,884970000B1103,,,,,,,,,,,,,0,,,,,T,terres,,,2400,6.416031,48.279293
2021-1510577,2021-09-15,000001,Vente,10065,,,POINTIERE DU HAUT DU CHENE,B087,88330,88497,Vaxoncourt,88,,,884970000B1104,,,,,,,,,,,,,0,,,,,T,terres,,,1730,6.415651,48.280005
2021-1510577,2021-09-15,000001,Vente,10065,,,POINTIERE DU HAUT DU CHENE,B087,88330,88497,Vaxoncourt,88,,,884970000B1105,,,,,,,,,,,,,0,,,,,T,terres,,,3270,6.415853,48.279976
2021-1510577,2021-09-15,000001,Vente,10065,,,POINTIERE DU HAUT DU CHENE,B087,88330,88497,Vaxoncourt,88,,,884970000B1106,,,,,,,,,,,,,0,,,,,T,terres,,,5080,6.416183,48.28004
2021-1510577,2021-09-15,000001,Vente,10065,,,POINTIERE DU HAUT DU CHENE,B087,88330,88497,Vaxoncourt,88,,,884970000B1107,,,,,,,,,,,,,0,,,,,T,terres,,,1070,6.416303,48.280167
2021-1510577,2021-09-15,000001,Vente,10065,,,POINTIERE DU HAUT DU CHENE,B087,88330,88497,Vaxoncourt,88,,,884970000B1108,,,,,,,,,,,,,0,,,,,T,terres,,,1830,6.416357,48.280255
2021-1510577,2021-09-15,000001,Vente,10065,,,POINTIERE DU HAUT DU CHENE,B087,88330,88497,Vaxoncourt,88,,,884970000B1109,,,,,,,,,,,,,0,,,,,T,terres,,,1460,6.416482,48.280304
2021-1510577,2021-09-15,000001,Vente,10065,,,POINTIERE DU HAUT DU CHENE,B087,88330,88497,Vaxoncourt,88,,,884970000B1110,,,,,,,,,,,,,0,,,,,T,terres,,,1650,6.416651,48.280245
2021-1510577,2021-09-15,000001,Vente,10065,,,POINTIERE DU HAUT DU CHENE,B087,88330,88497,Vaxoncourt,88,,,884970000B1111,,,,,,,,,,,,,0,,,,,T,terres,,,6170,6.417008,48.280211
2021-1510577,2021-09-15,000001,Vente,10065,,,POINTIERE DU HAUT DU CHENE,B087,88330,88497,Vaxoncourt,88,,,884970000B1112,,,,,,,,,,,,,0,,,,,T,terres,,,2270,6.417166,48.280451
2021-1510579,2021-09-15,000001,Vente,3433.5,,,PETIEY,B074,88330,88497,Vaxoncourt,88,,,884970000A1315,,,,,,,,,,,,,0,,,,,T,terres,,,5225,6.417152,48.287469
2021-1510579,2021-09-15,000001,Vente,3433.5,,,LA COTE DES BREBIS,B031,88330,88497,Vaxoncourt,88,,,884970000B0410,,,,,,,,,,,,,0,,,,,T,terres,,,1390,6.406218,48.286646
2021-1510579,2021-09-15,000001,Vente,3433.5,,,LA COTE DES BREBIS,B031,88330,88497,Vaxoncourt,88,,,884970000B0412,,,,,,,,,,,,,0,,,,,T,terres,,,1610,6.406306,48.286892
2021-1510579,2021-09-15,000001,Vente,3433.5,,,LA COTE DES BREBIS,B031,88330,88497,Vaxoncourt,88,,,884970000B0413,,,,,,,,,,,,,0,,,,,T,terres,,,1720,6.405919,48.286917
2021-1510579,2021-09-15,000001,Vente,3433.5,,,LA COTE DES BREBIS,B031,88330,88497,Vaxoncourt,88,,,884970000B0438,,,,,,,,,,,,,0,,,,,L,landes,FRICH,Friche,1500,6.404302,48.288128
2021-1510580,2021-09-15,000001,Vente,9780,,,LE BUISSON DE LA MAIRIE,B015,88330,88497,Vaxoncourt,88,,,884970000B0537,,,,,,,,,,,,,0,,,,,B,bois,AULN,Aulnaie,192,6.409692,48.281315
2021-1510580,2021-09-15,000001,Vente,9780,,,LE BUISSON DE LA MAIRIE,B015,88330,88497,Vaxoncourt,88,,,884970000B0539,,,,,,,,,,,,,0,,,,,T,terres,,,602,6.40987,48.281681
2021-1510580,2021-09-15,000001,Vente,9780,,,LE BUISSON DE LA MAIRIE,B015,88330,88497,Vaxoncourt,88,,,884970000B0540,,,,,,,,,,,,,0,,,,,T,terres,,,2282,6.410747,48.281937
2021-1510580,2021-09-15,000001,Vente,9780,,,LE BUISSON DE LA MAIRIE,B015,88330,88497,Vaxoncourt,88,,,884970000B0543,,,,,,,,,,,,,0,,,,,T,terres,,,1904,,
2021-1510580,2021-09-15,000001,Vente,9780,,,LE BUISSON DE LA MAIRIE,B015,88330,88497,Vaxoncourt,88,,,884970000B0544,,,,,,,,,,,,,0,,,,,T,terres,,,850,6.410937,48.282346
2021-1510580,2021-09-15,000001,Vente,9780,,,LE BUISSON DE LA MAIRIE,B015,88330,88497,Vaxoncourt,88,,,884970000B0545,,,,,,,,,,,,,0,,,,,T,terres,,,60,6.410969,48.282525
2021-1510580,2021-09-15,000001,Vente,9780,,,LE BUISSON DE LA MAIRIE,B015,88330,88497,Vaxoncourt,88,,,884970000B0546,,,,,,,,,,,,,0,,,,,T,terres,,,1640,,
2021-1510580,2021-09-15,000001,Vente,9780,,,SUR LA PALME,B073,88330,88497,Vaxoncourt,88,,,884970000B0597,,,,,,,,,,,,,0,,,,,P,prés,,,25070,6.408363,48.282975
2021-1510583,2021-09-15,000001,Vente,22723,,,LA RANNE,B110,88330,88497,Vaxoncourt,88,,,88497000ZA0001,,,,,,,,,,,,,0,,,,,P,prés,,,15700,6.427073,48.293829
2021-1510583,2021-09-15,000001,Vente,22723,,,LA RANNE,B110,88330,88497,Vaxoncourt,88,,,88497000ZA0001,,,,,,,,,,,,,0,,,,,L,landes,FRICH,Friche,10370,6.427073,48.293829
2021-1510583,2021-09-15,000001,Vente,22723,,,LA RANNE,B110,88330,88497,Vaxoncourt,88,,,88497000ZA0001,,,,,,,,,,,,,0,,,,,P,prés,,,32240,6.427073,48.293829
2021-1510583,2021-09-15,000001,Vente,22723,,,LA RANNE,B110,88330,88497,Vaxoncourt,88,,,88497000ZA0007,,,,,,,,,,,,,0,,,,,L,landes,FRICH,Friche,1470,6.429076,48.293654
2021-1510583,2021-09-15,000001,Vente,22723,,,LA RANNE,B110,88330,88497,Vaxoncourt,88,,,88497000ZA0007,,,,,,,,,,,,,0,,,,,P,prés,,,15963,6.429076,48.293654
2021-1510966,2021-09-30,000001,Vente,145000,27,,CHE DU TRIAL,0063,88330,88497,Vaxoncourt,88,,,884970000A0483,,,,,,,,,,,,,0,3,Dépendance,,0,T,terres,,,535,6.415769,48.294909
2021-1510966,2021-09-30,000001,Vente,145000,27,,CHE DU TRIAL,0063,88330,88497,Vaxoncourt,88,,,884970000A0483,,,,,,,,,,,,,0,1,Maison,118,6,T,terres,,,535,6.415769,48.294909
2021-1510966,2021-09-30,000001,Vente,145000,27,,CHE DU TRIAL,0063,88330,88497,Vaxoncourt,88,,,884970000A0483,,,,,,,,,,,,,0,3,Dépendance,,0,T,terres,,,535,6.415769,48.294909
2021-1510966,2021-09-30,000001,Vente,145000,27,,CHE DU TRIAL,0063,88330,88497,Vaxoncourt,88,,,884970000A0483,,,,,,,,,,,,,0,1,Maison,118,6,S,sols,,,690,6.415769,48.294909
2021-1510966,2021-09-30,000001,Vente,145000,27,,CHE DU TRIAL,0063,88330,88497,Vaxoncourt,88,,,884970000A0483,,,,,,,,,,,,,0,3,Dépendance,,0,S,sols,,,690,6.415769,48.294909
2021-1510966,2021-09-30,000001,Vente,145000,27,,CHE DU TRIAL,0063,88330,88497,Vaxoncourt,88,,,884970000A0483,,,,,,,,,,,,,0,3,Dépendance,,0,S,sols,,,690,6.415769,48.294909
2021-1511603,2021-10-21,000001,Vente,12800,,,POINTIERE DU VIEUX PRE,B088,88330,88497,Vaxoncourt,88,,,884970000A0003,,,,,,,,,,,,,0,,,,,T,terres,,,3630,6.421625,48.307063
2021-1511603,2021-10-21,000001,Vente,12800,,,2EME POIN DE DROIDE CHERRI,B123,88330,88497,Vaxoncourt,88,,,884970000A1047,,,,,,,,,,,,,0,,,,,T,terres,,,1040,6.423413,48.284714
2021-1511603,2021-10-21,000001,Vente,12800,,,2EME POIN DE DROIDE CHERRI,B123,88330,88497,Vaxoncourt,88,,,884970000A1048,,,,,,,,,,,,,0,,,,,T,terres,,,3420,6.423545,48.284536
2021-1511603,2021-10-21,000001,Vente,12800,,,2EME POIN DE DROIDE CHERRI,B123,88330,88497,Vaxoncourt,88,,,884970000A1063,,,,,,,,,,,,,0,,,,,T,terres,,,2150,6.426288,48.283997
2021-1511603,2021-10-21,000001,Vente,12800,,,2EME POIN DE DROIDE CHERRI,B123,88330,88497,Vaxoncourt,88,,,884970000A1066,,,,,,,,,,,,,0,,,,,T,terres,,,1740,6.426686,48.283781
2021-1511603,2021-10-21,000001,Vente,12800,,,2EME POIN DE DROIDE CHERRI,B123,88330,88497,Vaxoncourt,88,,,884970000A1067,,,,,,,,,,,,,0,,,,,T,terres,,,2210,6.42688,48.283769
2021-1511603,2021-10-21,000001,Vente,12800,,,2EME POIN DE DROIDE CHERRI,B123,88330,88497,Vaxoncourt,88,,,884970000A1073,,,,,,,,,,,,,0,,,,,T,terres,,,1410,6.427705,48.283343
2021-1511603,2021-10-21,000001,Vente,12800,,,DEVANT LE BOIS BANNI,B042,88330,88497,Vaxoncourt,88,,,884970000A1085,,,,,,,,,,,,,0,,,,,T,terres,,,960,6.427333,48.282526
2021-1511603,2021-10-21,000001,Vente,12800,,,LA CAVE JEANDAT,B018,88330,88497,Vaxoncourt,88,,,884970000B0014,,,,,,,,,,,,,0,,,,,B,bois,AULN,Aulnaie,1320,6.407187,48.303297