id_mutation,date_mutation,numero_disposition,nature_mutation,valeur_fonciere,adresse_numero,adresse_suffixe,adresse_nom_voie,adresse_code_voie,code_postal,code_commune,nom_commune,code_departement,ancien_code_commune,ancien_nom_commune,id_parcelle,ancien_id_parcelle,numero_volume,lot1_numero,lot1_surface_carrez,lot2_numero,lot2_surface_carrez,lot3_numero,lot3_surface_carrez,lot4_numero,lot4_surface_carrez,lot5_numero,lot5_surface_carrez,nombre_lots,code_type_local,type_local,surface_reelle_bati,nombre_pieces_principales,code_nature_culture,nature_culture,code_nature_culture_speciale,nature_culture_speciale,surface_terrain,longitude,latitude
2021-1507564,2021-04-30,000001,Vente,210000,,,BOIS DE LA COMMANDERIE,B003,88150,88509,Villoncourt,88,,,885090000B0872,,,,,,,,,,,,,0,,,,,BS,taillis sous futaie,,,188880,6.523573,48.271757
2021-1508198,2021-06-10,000001,Vente,5000,,,CROXIERE,B008,88150,88509,Villoncourt,88,,,88509000ZA0005,,,,,,,,,,,,,0,,,,,T,terres,,,3840,6.506038,48.26408
2021-1508198,2021-06-10,000001,Vente,5000,,,CROXIERE,B008,88150,88509,Villoncourt,88,,,88509000ZA0006,,,,,,,,,,,,,0,,,,,T,terres,,,10160,6.505418,48.264064
2021-1509032,2021-02-08,000002,Vente,340,,,LE VILLAGE,B033,88150,88509,Villoncourt,88,,,88509000AA0135,,,,,,,,,,,,,0,,,,,S,sols,,,30,6.512248,48.263344
2021-1509032,2021-02-08,000002,Vente,340,,,LE VILLAGE,B033,88150,88509,Villoncourt,88,,,88509000AA0137,,,,,,,,,,,,,0,,,,,J,jardins,,,4,6.512321,48.263365
2021-1511096,2021-10-20,000001,Vente,55853,,,LE VILLAGE,B033,88150,88509,Villoncourt,88,,,88509000AA0050,,,,,,,,,,,,,0,,,,,J,jardins,,,667,6.511118,48.262398
2021-1511096,2021-10-20,000001,Vente,55853,2,,RUE DU MOULIN,0042,88150,88509,Villoncourt,88,,,88509000AA0051,,,,,,,,,,,,,0,1,Maison,114,4,P,prés,,,6366,6.510587,48.262354
2021-1511096,2021-10-20,000001,Vente,55853,2,,RUE DU MOULIN,0042,88150,88509,Villoncourt,88,,,88509000AA0051,,,,,,,,,,,,,0,1,Maison,114,4,S,sols,,,1930,6.510587,48.262354
2021-1511096,2021-10-20,000001,Vente,55853,,,PRE MARQUAIRE,B020,88150,88509,Villoncourt,88,,,88509000ZC0005,,,,,,,,,,,,,0,,,,,P,prés,,,11840,6.509033,48.261685
2021-1511096,2021-10-20,000001,Vente,55853,,,PRE MARQUAIRE,B020,88150,88509,Villoncourt,88,,,88509000ZC0005,,,,,,,,,,,,,0,,,,,P,prés,,,11840,6.509033,48.261685
2021-1511691,2021-08-16,000001,Vente,240000,2,,GR GRANDE RUE,0041,88150,88509,Villoncourt,88,,,88509000ZC0046,,,,,,,,,,,,,0,1,Maison,151,5,J,jardins,,,683,6.508563,48.262484
2021-1511691,2021-08-16,000001,Vente,240000,2,,GR GRANDE RUE,0041,88150,88509,Villoncourt,88,,,88509000ZC0046,,,,,,,,,,,,,0,1,Maison,151,5,S,sols,,,500,6.508563,48.262484
2021-1511999,2021-11-03,000001,Vente,55000,23,,GR GRANDE RUE,0041,88150,88509,Villoncourt,88,,,88509000AA0094,,,,,,,,,,,,,0,1,Maison,148,6,S,sols,,,490,6.513719,48.263407
