id_mutation,date_mutation,numero_disposition,nature_mutation,valeur_fonciere,adresse_numero,adresse_suffixe,adresse_nom_voie,adresse_code_voie,code_postal,code_commune,nom_commune,code_departement,ancien_code_commune,ancien_nom_commune,id_parcelle,ancien_id_parcelle,numero_volume,lot1_numero,lot1_surface_carrez,lot2_numero,lot2_surface_carrez,lot3_numero,lot3_surface_carrez,lot4_numero,lot4_surface_carrez,lot5_numero,lot5_surface_carrez,nombre_lots,code_type_local,type_local,surface_reelle_bati,nombre_pieces_principales,code_nature_culture,nature_culture,code_nature_culture_speciale,nature_culture_speciale,surface_terrain,longitude,latitude
2021-1507478,2021-05-19,000001,Vente,3665,,,LE HAUT DU BOIS,B046,88460,88528,Xamontarupt,88,,,885280000A0925,,,,,,,,,,,,,0,,,,,L,landes,FRICH,Friche,15675,6.621579,48.120443
2021-1507492,2021-05-25,000001,Vente terrain à bâtir,27000,,,A LA FEIGNE,B035,88460,88528,Xamontarupt,88,,,885280000A0979,,,,,,,,,,,,,0,,,,,T,terres,,,986,6.657018,48.133603
2021-1507736,2021-05-27,000001,Vente,1200,,,HAUT DE CELLE,B044,88460,88528,Xamontarupt,88,,,885280000A0888,,,,,,,,,,,,,0,,,,,P,prés,,,1593,6.654578,48.116656
2021-1508252,2021-06-23,000001,Vente,179000,27,,HAUT DE GEMEL,B045,88460,88528,Xamontarupt,88,,,885280000A0980,,,,,,,,,,,,,0,3,Dépendance,,0,S,sols,,,986,6.657157,48.133219
2021-1508252,2021-06-23,000001,Vente,179000,27,,HAUT DE GEMEL,B045,88460,88528,Xamontarupt,88,,,885280000A0980,,,,,,,,,,,,,0,3,Dépendance,,0,S,sols,,,986,6.657157,48.133219
2021-1508252,2021-06-23,000001,Vente,179000,27,,HAUT DE GEMEL,B045,88460,88528,Xamontarupt,88,,,885280000A0980,,,,,,,,,,,,,0,3,Dépendance,,0,S,sols,,,986,6.657157,48.133219
2021-1508252,2021-06-23,000001,Vente,179000,27,,HAUT DE GEMEL,B045,88460,88528,Xamontarupt,88,,,885280000A0980,,,,,,,,,,,,,0,2,Appartement,100,3,S,sols,,,986,6.657157,48.133219
2021-1508252,2021-06-23,000001,Vente,179000,27,,HAUT DE GEMEL,B045,88460,88528,Xamontarupt,88,,,885280000A0980,,,,,,,,,,,,,0,2,Appartement,100,3,S,sols,,,986,6.657157,48.133219
2021-1508252,2021-06-23,000001,Vente,179000,,,A LA FEIGNE,B035,88460,88528,Xamontarupt,88,,,885280000A0981,,,,,,,,,,,,,0,,,,,T,terres,,,408,6.65726,48.132951
2021-1508252,2021-06-23,000001,Vente,179000,,,A LA FEIGNE,B035,88460,88528,Xamontarupt,88,,,885280000A0983,,,,,,,,,,,,,0,,,,,P,prés,,,198,6.657118,48.132927
2021-1508311,2021-07-07,000001,Vente,1000,,,LE VILLAGE,B075,88460,88528,Xamontarupt,88,,,885280000A0183,,,,,,,,,,,,,0,,,,,P,prés,,,1245,6.651229,48.13303
2021-1509357,2021-08-03,000001,Vente,25000,,,LA BOLLE,B007,88460,88528,Xamontarupt,88,,,885280000A0657,,,,,,,,,,,,,0,,,,,S,sols,,,729,6.662891,48.119159
2021-1511285,2021-10-06,000001,Vente,200,,,CLOS DE CHARMOIS,B018,88460,88528,Xamontarupt,88,,,885280000A1117,,,,,,,,,,,,,0,,,,,T,terres,,,198,6.651931,48.132028
2021-1511285,2021-10-06,000001,Vente,200,,,CLOS DE CHARMOIS,B018,88460,88528,Xamontarupt,88,,,885280000A1119,,,,,,,,,,,,,0,,,,,P,prés,,,146,6.651543,48.132236
2021-1512511,2021-12-06,000002,Vente,1,,,HAUT DE CELLE,B044,88460,88528,Xamontarupt,88,,,885280000A1040,,,,,,,,,,,,,0,,,,,P,prés,,,1599,6.656741,48.116794
