id_mutation,date_mutation,numero_disposition,nature_mutation,valeur_fonciere,adresse_numero,adresse_suffixe,adresse_nom_voie,adresse_code_voie,code_postal,code_commune,nom_commune,code_departement,ancien_code_commune,ancien_nom_commune,id_parcelle,ancien_id_parcelle,numero_volume,lot1_numero,lot1_surface_carrez,lot2_numero,lot2_surface_carrez,lot3_numero,lot3_surface_carrez,lot4_numero,lot4_surface_carrez,lot5_numero,lot5_surface_carrez,nombre_lots,code_type_local,type_local,surface_reelle_bati,nombre_pieces_principales,code_nature_culture,nature_culture,code_nature_culture_speciale,nature_culture_speciale,surface_terrain,longitude,latitude
2021-1517199,2021-01-12,000001,Vente,95000,2,,CHE DES  HAIES,0180,89360,89061,Butteaux,89,,,89061000AD0259,,,,,,,,,,,,,0,1,Maison,80,3,S,sols,,,936,3.809169,47.978392
2021-1518254,2021-05-12,000002,Vente,2000,,,LE VILLAGE,B075,89360,89061,Butteaux,89,,,89061000AD0319,,,,,,,,,,,,,0,,,,,S,sols,,,162,3.80783,47.978929
2021-1518260,2021-05-12,000002,Vente,23000,11,,RUE DE L ARMANCON,0015,89360,89061,Butteaux,89,,,89061000AD0320,,,,,,,,,,,,,0,1,Maison,55,2,S,sols,,,608,3.807797,47.97848
2021-1518260,2021-05-12,000002,Vente,23000,11,,RUE DE L ARMANCON,0015,89360,89061,Butteaux,89,,,89061000AD0320,,,,,,,,,,,,,0,1,Maison,38,2,S,sols,,,608,3.807797,47.97848
2021-1518260,2021-05-12,000002,Vente,23000,,,RUE DE L ARMANCON,0015,89360,89061,Butteaux,89,,,89061000AD0321,,,,,,,,,,,,,0,,,,,S,sols,,,512,3.807613,47.978763
2021-1519713,2021-09-14,000001,Vente,134000,,,LE VILLAGE,B075,89360,89061,Butteaux,89,,,89061000AD0069,,,,,,,,,,,,,0,,,,,J,jardins,,,620,3.808729,47.977084
2021-1519713,2021-09-14,000001,Vente,134000,,,LE VILLAGE,B075,89360,89061,Butteaux,89,,,89061000AD0070,,,,,,,,,,,,,0,,,,,VE,vergers,,,650,3.808939,47.977043
2021-1519713,2021-09-14,000001,Vente,134000,11,,RUE SAINT ROCH,0320,89360,89061,Butteaux,89,,,89061000AD0280,,,,,,,,,,,,,0,3,Dépendance,,0,S,sols,,,851,3.808915,47.97733
2021-1519713,2021-09-14,000001,Vente,134000,11,,RUE SAINT ROCH,0320,89360,89061,Butteaux,89,,,89061000AD0280,,,,,,,,,,,,,0,1,Maison,140,5,S,sols,,,851,3.808915,47.97733
2021-1519713,2021-09-14,000001,Vente,134000,11,,RUE SAINT ROCH,0320,89360,89061,Butteaux,89,,,89061000AD0280,,,,,,,,,,,,,0,3,Dépendance,,0,S,sols,,,851,3.808915,47.97733
2021-1520572,2021-10-18,000002,Vente,1000,,,VERDET,B072,89360,89061,Butteaux,89,,,89061000ZE0209,,,,,,,,,,,,,0,,,,,T,terres,,,1008,3.804275,47.979495
2021-1520841,2021-10-28,000001,Vente,700,,,LA PATISSIERE,B047,89360,89061,Butteaux,89,,,89061000ZH0092,,,,,,,,,,,,,0,,,,,P,prés,,,3720,3.819028,47.981899
2021-1521125,2021-11-22,000001,Vente,700,,,LES FORETS,B031,89360,89061,Butteaux,89,,,89061000ZH0086,,,,,,,,,,,,,0,,,,,BT,taillis simples,,,370,3.830122,47.987357
2021-1522107,2021-12-16,000001,Vente,2500,1,X,RUE DE L ARMANCON,0015,89360,89061,Butteaux,89,,,89061000AD0191,,,,,,,,,,,,,0,3,Dépendance,,0,VE,vergers,,,1110,3.8062,47.977159
2021-1522107,2021-12-16,000001,Vente,2500,,,LA CROIX DU VERGER,B023,89360,89061,Butteaux,89,,,89061000AD0192,,,,,,,,,,,,,0,,,,,T,terres,,,1046,3.805416,47.976722
