id_mutation,date_mutation,numero_disposition,nature_mutation,valeur_fonciere,adresse_numero,adresse_suffixe,adresse_nom_voie,adresse_code_voie,code_postal,code_commune,nom_commune,code_departement,ancien_code_commune,ancien_nom_commune,id_parcelle,ancien_id_parcelle,numero_volume,lot1_numero,lot1_surface_carrez,lot2_numero,lot2_surface_carrez,lot3_numero,lot3_surface_carrez,lot4_numero,lot4_surface_carrez,lot5_numero,lot5_surface_carrez,nombre_lots,code_type_local,type_local,surface_reelle_bati,nombre_pieces_principales,code_nature_culture,nature_culture,code_nature_culture_speciale,nature_culture_speciale,surface_terrain,longitude,latitude
2021-1520861,2021-11-15,000001,Vente,185800,,,LE VILLAGE,B105,89400,89105,Chichery,89,,,891050000C0197,,,,,,,,,,,,,0,,,,,J,jardins,,,856,3.507089,47.901558
2021-1520861,2021-11-15,000001,Vente,185800,22,,LE VILLAGE,B105,89400,89105,Chichery,89,,,891050000C1103,,,,,,,,,,,,,0,3,Dépendance,,0,S,sols,,,37,3.507449,47.902025
2021-1520861,2021-11-15,000001,Vente,185800,23,,RUE DU FOSSE L EVEQUE,0110,89400,89105,Chichery,89,,,891050000C1104,,,,,,,,,,,,,0,3,Dépendance,,0,S,sols,,,1152,3.507365,47.901876
2021-1520861,2021-11-15,000001,Vente,185800,23,,RUE DU FOSSE L EVEQUE,0110,89400,89105,Chichery,89,,,891050000C1104,,,,,,,,,,,,,0,1,Maison,132,3,S,sols,,,1152,3.507365,47.901876
2021-1520861,2021-11-15,000001,Vente,185800,23,,RUE DU FOSSE L EVEQUE,0110,89400,89105,Chichery,89,,,891050000C1104,,,,,,,,,,,,,0,1,Maison,15,1,S,sols,,,1152,3.507365,47.901876
2021-1520861,2021-11-15,000001,Vente,185800,23,,RUE DU FOSSE L EVEQUE,0110,89400,89105,Chichery,89,,,891050000C1104,,,,,,,,,,,,,0,3,Dépendance,,0,S,sols,,,1152,3.507365,47.901876
2021-1520861,2021-11-15,000001,Vente,185800,23,,RUE DU FOSSE L EVEQUE,0110,89400,89105,Chichery,89,,,891050000C1104,,,,,,,,,,,,,0,3,Dépendance,,0,S,sols,,,1152,3.507365,47.901876
2021-1520861,2021-11-15,000001,Vente,185800,23,,RUE DU FOSSE L EVEQUE,0110,89400,89105,Chichery,89,,,891050000C1104,,,,,,,,,,,,,0,3,Dépendance,,0,S,sols,,,1152,3.507365,47.901876
2021-1520861,2021-11-15,000001,Vente,185800,23,,RUE DU FOSSE L EVEQUE,0110,89400,89105,Chichery,89,,,891050000C1104,,,,,,,,,,,,,0,3,Dépendance,,0,S,sols,,,1152,3.507365,47.901876
2021-1521815,2021-12-09,000001,Vente,140000,14,,RUE DES CORNES DU DIABLE,0070,89400,89105,Chichery,89,,,891050000C1105,,,,,,,,,,,,,0,3,Dépendance,,0,S,sols,,,475,3.508602,47.902795
2021-1521815,2021-12-09,000001,Vente,140000,14,,RUE DES CORNES DU DIABLE,0070,89400,89105,Chichery,89,,,891050000C1105,,,,,,,,,,,,,0,1,Maison,105,5,S,sols,,,475,3.508602,47.902795
2021-1524258,2021-02-12,000001,Vente,120000,42,,RUE DU PUITS D HIVER,0210,89400,89105,Chichery,89,,,891050000C0041,,,,,,,,,,,,,0,1,Maison,93,3,S,sols,,,121,3.512715,47.902843
2021-1524259,2021-02-12,000001,Vente,1000,,,RAVEUSE,B088,89400,89105,Chichery,89,,,891050000B0420,,,,,,,,,,,,,0,,,,,BT,taillis simples,,,1536,3.521248,47.905242
2021-1524491,2021-03-10,000001,Vente,51900,,,CHAMP PAILLARD,B010,89400,89105,Chichery,89,,,89105000ZP0044,,,,,,,,,,,,,0,,,,,T,terres,,,529,3.508124,47.905001
2021-1524491,2021-03-10,000001,Vente,51900,,,CHAMP PAILLARD,B010,89400,89105,Chichery,89,,,89105000ZP0045,,,,,,,,,,,,,0,,,,,T,terres,,,1289,3.507914,47.904925
2021-1524570,2021-04-06,000001,Vente,900,,,DEVANT LE FORT,B044,89400,89105,Chichery,89,,,89105000ZA0063,,,,,,,,,,,,,0,,,,,T,terres,,,878,3.525988,47.916141
2021-1524570,2021-04-06,000001,Vente,900,,,DEVANT LE FORT,B044,89400,89105,Chichery,89,,,89105000ZA0064,,,,,,,,,,,,,0,,,,,BT,taillis simples,,,2560,3.527709,47.916689
2021-1524570,2021-04-06,000001,Vente,900,,,DEVANT LE FORT,B044,89400,89105,Chichery,89,,,89105000ZA0065,,,,,,,,,,,,,0,,,,,BT,taillis simples,,,1155,3.5277,47.916609
2021-1524570,2021-04-06,000001,Vente,900,,,DEVANT LE FORT,B044,89400,89105,Chichery,89,,,89105000ZA0066,,,,,,,,,,,,,0,,,,,T,terres,,,386,3.526087,47.916094
2021-1524636,2021-04-21,000001,Vente,1417.5,,,LA SABLONNIERE,B092,89400,89105,Chichery,89,,,89105000ZA0083,,,,,,,,,,,,,0,,,,,CA,carrières,SABLE,Sablière,1050,,
2021-1525151,2021-06-18,000001,Vente,154000,14,,RUE DU MILIEU,0180,89400,89105,Chichery,89,,,891050000C0120,,,,,,,,,,,,,0,3,Dépendance,,0,S,sols,,,188,3.510316,47.902288
2021-1525151,2021-06-18,000001,Vente,154000,14,,RUE DU MILIEU,0180,89400,89105,Chichery,89,,,891050000C0120,,,,,,,,,,,,,0,3,Dépendance,,0,S,sols,,,188,3.510316,47.902288
2021-1525151,2021-06-18,000001,Vente,154000,14,,RUE DU MILIEU,0180,89400,89105,Chichery,89,,,891050000C0120,,,,,,,,,,,,,0,3,Dépendance,,0,S,sols,,,188,3.510316,47.902288
2021-1525151,2021-06-18,000001,Vente,154000,14,,RUE DU MILIEU,0180,89400,89105,Chichery,89,,,891050000C0120,,,,,,,,,,,,,0,1,Maison,84,3,S,sols,,,188,3.510316,47.902288
2021-1525769,2021-09-15,000002,Vente,20000,,,LA PRIE,B086,89400,89105,Chichery,89,,,891050000A1281,,,,,,,,,,,,,0,,,,,T,terres,,,170,3.509782,47.905309
2021-1525769,2021-09-15,000002,Vente,20000,,,LA PRIE,B086,89400,89105,Chichery,89,,,891050000A1283,,,,,,,,,,,,,0,,,,,T,terres,,,83,3.509734,47.905353
2021-1525769,2021-09-15,000002,Vente,20000,,,LA PRIE,B086,89400,89105,Chichery,89,,,891050000A1285,,,,,,,,,,,,,0,,,,,T,terres,,,77,3.509675,47.905369
2021-1525769,2021-09-15,000002,Vente,20000,,,LA PRIE,B086,89400,89105,Chichery,89,,,891050000A1287,,,,,,,,,,,,,0,,,,,T,terres,,,170,3.50959,47.905392
