id_mutation,date_mutation,numero_disposition,nature_mutation,valeur_fonciere,adresse_numero,adresse_suffixe,adresse_nom_voie,adresse_code_voie,code_postal,code_commune,nom_commune,code_departement,ancien_code_commune,ancien_nom_commune,id_parcelle,ancien_id_parcelle,numero_volume,lot1_numero,lot1_surface_carrez,lot2_numero,lot2_surface_carrez,lot3_numero,lot3_surface_carrez,lot4_numero,lot4_surface_carrez,lot5_numero,lot5_surface_carrez,nombre_lots,code_type_local,type_local,surface_reelle_bati,nombre_pieces_principales,code_nature_culture,nature_culture,code_nature_culture_speciale,nature_culture_speciale,surface_terrain,longitude,latitude
2021-1520641,2021-10-29,000001,Vente,11000,3,,RUE DE L EGLISE,0060,89660,89177,Fontenay-sous-Fouronnes,89,,,891770000C0069,,,,,,,,,,,,,0,3,Dépendance,,0,S,sols,,,2163,3.596169,47.615044
2021-1520641,2021-10-29,000001,Vente,11000,3,,RUE DE L EGLISE,0060,89660,89177,Fontenay-sous-Fouronnes,89,,,891770000C0069,,,,,,,,,,,,,0,3,Dépendance,,0,S,sols,,,2163,3.596169,47.615044
2021-1520641,2021-10-29,000001,Vente,11000,3,,RUE DE L EGLISE,0060,89660,89177,Fontenay-sous-Fouronnes,89,,,891770000C0069,,,,,,,,,,,,,0,1,Maison,115,3,S,sols,,,2163,3.596169,47.615044
2021-1522454,2021-12-23,000001,Vente,30000,,,FONTENAY,B060,89660,89177,Fontenay-sous-Fouronnes,89,,,891770000C0051,,,,,,,,,,,,,0,,,,,T,terres,,,967,3.596703,47.615626
2021-1522454,2021-12-23,000001,Vente,30000,7,,RUE DE FOURONNES,0085,89660,89177,Fontenay-sous-Fouronnes,89,,,891770000C1345,,,,,,,,,,,,,0,3,Dépendance,,0,S,sols,,,798,3.596878,47.615396
2021-1522454,2021-12-23,000001,Vente,30000,7,,RUE DE FOURONNES,0085,89660,89177,Fontenay-sous-Fouronnes,89,,,891770000C1345,,,,,,,,,,,,,0,3,Dépendance,,0,S,sols,,,798,3.596878,47.615396
2021-1522778,2021-06-19,000001,Vente,800,,,LES GROSSES TERRES,B076,89660,89177,Fontenay-sous-Fouronnes,89,,,891770000B0745,,,,,,,,,,,,,0,,,,,BT,taillis simples,,,1800,3.615118,47.606175
2021-1522778,2021-06-19,000001,Vente,800,,,LES GROSSES TERRES,B076,89660,89177,Fontenay-sous-Fouronnes,89,,,891770000B0749,,,,,,,,,,,,,0,,,,,BT,taillis simples,,,1790,3.615941,47.606127
2021-1522796,2021-01-14,000001,Vente,70740,,,LA GABETTE,B062,89660,89177,Fontenay-sous-Fouronnes,89,,,891770000B0955,,,,,,,,,,,,,0,,,,,T,terres,,,223,3.598446,47.614138
2021-1522796,2021-01-14,000001,Vente,70740,,,LA GABETTE,B062,89660,89177,Fontenay-sous-Fouronnes,89,,,891770000B0956,,,,,,,,,,,,,0,,,,,T,terres,,,967,3.598296,47.614187
2021-1522796,2021-01-14,000001,Vente,70740,27,,RUE DE MAILLY LE CHATEAU,0190,89660,89177,Fontenay-sous-Fouronnes,89,,,891770000B0967,,,,,,,,,,,,,0,1,Maison,51,3,S,sols,,,500,3.597915,47.614255
2021-1522796,2021-01-14,000001,Vente,70740,27,,RUE DE MAILLY LE CHATEAU,0190,89660,89177,Fontenay-sous-Fouronnes,89,,,891770000B0967,,,,,,,,,,,,,0,1,Maison,51,3,T,terres,,,1728,3.597915,47.614255
2021-1522848,2021-02-01,000001,Vente,65000,5,,RUE DE LA GABETTE,0095,89660,89177,Fontenay-sous-Fouronnes,89,,,891770000B0943,,,,,,,,,,,,,0,1,Maison,86,5,S,sols,,,676,3.599289,47.613453
2021-1522848,2021-02-01,000001,Vente,65000,5,,RUE DE LA GABETTE,0095,89660,89177,Fontenay-sous-Fouronnes,89,,,891770000B0943,,,,,,,,,,,,,0,1,Maison,86,5,L,landes,,,540,3.599289,47.613453
2021-1523051,2021-03-18,000001,Vente,66000,,,VALOTTE,B130,89660,89177,Fontenay-sous-Fouronnes,89,,,891770000B0044,,,,,,,,,,,,,0,,,,,L,landes,,,4440,3.598874,47.614884
2021-1523051,2021-03-18,000001,Vente,66000,23,,RUE DE MAILLY LE CHATEAU,0190,89660,89177,Fontenay-sous-Fouronnes,89,,,891770000B0242,,,,,,,,,,,,,0,1,Maison,75,3,S,sols,,,545,3.59794,47.614904
2021-1523051,2021-03-18,000001,Vente,66000,,,FONTENAY,B060,89660,89177,Fontenay-sous-Fouronnes,89,,,891770000B0243,,,,,,,,,,,,,0,,,,,L,landes,,,617,3.598351,47.614895
2021-1523051,2021-03-18,000001,Vente,66000,,,PRES TARDIFS,B096,89660,89177,Fontenay-sous-Fouronnes,89,,,89177000ZI0012,,,,,,,,,,,,,0,,,,,T,terres,,,363,3.593167,47.618389
2021-1523106,2021-03-09,000001,Vente,20000,,,FONTENAY,B060,89660,89177,Fontenay-sous-Fouronnes,89,,,891770000C0045,,,,,,,,,,,,,0,,,,,S,sols,,,132,3.596261,47.615683
2021-1523106,2021-03-09,000001,Vente,20000,7,,RUE DE FOURONNES,0085,89660,89177,Fontenay-sous-Fouronnes,89,,,891770000C0046,,,,,,,,,,,,,0,1,Maison,25,1,S,sols,,,38,3.596245,47.61571
2021-1523106,2021-03-09,000001,Vente,20000,,,FONTENAY,B060,89660,89177,Fontenay-sous-Fouronnes,89,,,891770000C0047,,,,,,,,,,,,,0,,,,,S,sols,,,43,3.5963,47.615742
2021-1523106,2021-03-09,000001,Vente,20000,,,FONTENAY,B060,89660,89177,Fontenay-sous-Fouronnes,89,,,891770000C0048,,,,,,,,,,,,,0,,,,,S,sols,,,50,3.596259,47.615586
2021-1523106,2021-03-09,000001,Vente,20000,,,FONTENAY,B060,89660,89177,Fontenay-sous-Fouronnes,89,,,891770000C0049,,,,,,,,,,,,,0,,,,,S,sols,,,50,3.596354,47.61561
2021-1523106,2021-03-09,000001,Vente,20000,,,FONTENAY,B060,89660,89177,Fontenay-sous-Fouronnes,89,,,891770000C0050,,,,,,,,,,,,,0,,,,,J,jardins,,,288,3.59643,47.615602
2021-1523106,2021-03-09,000001,Vente,20000,,,LE COTAT GRENOIS,B048,89660,89177,Fontenay-sous-Fouronnes,89,,,891770000D0699,,,,,,,,,,,,,0,,,,,BT,taillis simples,,,500,3.593804,47.616819
2021-1523106,2021-03-09,000001,Vente,20000,,,LE COTAT GRENOIS,B048,89660,89177,Fontenay-sous-Fouronnes,89,,,891770000D0700,,,,,,,,,,,,,0,,,,,L,landes,,,510,3.593749,47.616961
2021-1523674,2021-07-17,000001,Vente,35000,,,FONTENAY,B060,89660,89177,Fontenay-sous-Fouronnes,89,,,891770000C0056,,,,,,,,,,,,,0,,,,,J,jardins,,,110,3.59732,47.615657
2021-1523674,2021-07-17,000001,Vente,35000,,,FONTENAY,B060,89660,89177,Fontenay-sous-Fouronnes,89,,,891770000C1346,,,,,,,,,,,,,0,,,,,J,jardins,,,31,3.597114,47.615799
2021-1523674,2021-07-17,000001,Vente,35000,2,,RUE DE MAILLY LE CHATEAU,0190,89660,89177,Fontenay-sous-Fouronnes,89,,,891770000C1349,,,,,,,,,,,,,0,3,Dépendance,,0,S,sols,,,276,3.597232,47.615793
2021-1523674,2021-07-17,000001,Vente,35000,2,,RUE DE MAILLY LE CHATEAU,0190,89660,89177,Fontenay-sous-Fouronnes,89,,,891770000C1349,,,,,,,,,,,,,0,1,Maison,80,3,S,sols,,,276,3.597232,47.615793
2021-1523674,2021-07-17,000001,Vente,35000,2,,RUE DE MAILLY LE CHATEAU,0190,89660,89177,Fontenay-sous-Fouronnes,89,,,891770000C1349,,,,,,,,,,,,,0,3,Dépendance,,0,S,sols,,,276,3.597232,47.615793
2021-1523866,2021-08-27,000001,Vente,21600,,,LES GROSSES TERRES,B076,89660,89177,Fontenay-sous-Fouronnes,89,,,891770000B0731,,,,,,,,,,,,,0,,,,,BT,taillis simples,,,1685,3.61124,47.606085
