id_mutation,date_mutation,numero_disposition,nature_mutation,valeur_fonciere,adresse_numero,adresse_suffixe,adresse_nom_voie,adresse_code_voie,code_postal,code_commune,nom_commune,code_departement,ancien_code_commune,ancien_nom_commune,id_parcelle,ancien_id_parcelle,numero_volume,lot1_numero,lot1_surface_carrez,lot2_numero,lot2_surface_carrez,lot3_numero,lot3_surface_carrez,lot4_numero,lot4_surface_carrez,lot5_numero,lot5_surface_carrez,nombre_lots,code_type_local,type_local,surface_reelle_bati,nombre_pieces_principales,code_nature_culture,nature_culture,code_nature_culture_speciale,nature_culture_speciale,surface_terrain,longitude,latitude
2021-1519816,2021-10-04,000001,Vente,205500,,,LES CONSISES GALLOT,B031,89110,89196,Valravillon,89,,,89196000AI0326,,,,,,,,,,,,,0,,,,,S,sols,,,498,3.427239,47.890455
2021-1519816,2021-10-04,000001,Vente,205500,15,,CHE DU PETIT ENCLOS,0140,89110,89196,Valravillon,89,,,89196000AI0327,,,,,,,,,,,,,0,1,Maison,95,5,S,sols,,,498,3.427102,47.890215
2021-1519816,2021-10-04,000001,Vente,205500,,,LES CONSISES GALLOT,B031,89110,89196,Valravillon,89,,,89196000AI0328,,,,,,,,,,,,,0,,,,,AB,terrains a bâtir,,,199,3.427289,47.89036
2021-1520033,2021-09-30,000001,Vente,1200,,,LES PRES SONNEURS,B098,89110,89196,Valravillon,89,,,891960000E0048,,,,,,,,,,,,,0,,,,,BP,peupleraies,,,860,3.430579,47.891814
2021-1520033,2021-09-30,000001,Vente,1200,,,LES VERNES DE CORNU,B119,89110,89196,Valravillon,89,,,891960000E0096,,,,,,,,,,,,,0,,,,,BP,peupleraies,,,310,3.42957,47.88916
2021-1520033,2021-09-30,000001,Vente,1200,,,CORNU,B036,89110,89196,Valravillon,89,,,891960000E0110,,,,,,,,,,,,,0,,,,,BP,peupleraies,,,835,3.42856,47.889678
2021-1520033,2021-09-30,000001,Vente,1200,,,LES PRES DE CORNU,B092,89110,89196,Valravillon,89,,,891960000E0153,,,,,,,,,,,,,0,,,,,BP,peupleraies,,,1007,3.425125,47.886205
2021-1520033,2021-09-30,000001,Vente,1200,,,MOILLOT,B068,89110,89196,Valravillon,89,,,891960000E0215,,,,,,,,,,,,,0,,,,,BP,peupleraies,,,290,3.422915,47.884029
2021-1520033,2021-09-30,000001,Vente,1200,,,MOILLOT,B068,89110,89196,Valravillon,89,,,891960000E0300,,,,,,,,,,,,,0,,,,,BP,peupleraies,,,430,3.427524,47.887617
2021-1520033,2021-09-30,000001,Vente,1200,,,LA GARENNE GUERCHY,B048,89110,89196,Valravillon,89,,,891960000E0492,,,,,,,,,,,,,0,,,,,BT,taillis simples,,,330,3.443386,47.883275
2021-1520033,2021-09-30,000001,Vente,1200,,,LES PRES CAMIATS,B090,89110,89196,Valravillon,89,,,891960000E0560,,,,,,,,,,,,,0,,,,,BT,taillis simples,,,8165,3.437247,47.885563
2021-1520088,2021-09-30,000001,Vente,220000,9000,,IMP DU PETIT PRESSOIR,0180,89110,89196,Valravillon,89,,,89196000AI0291,,,,,,,,,,,,,0,1,Maison,148,5,J,jardins,,,459,3.425874,47.893756
2021-1520088,2021-09-30,000001,Vente,220000,9000,,IMP DU PETIT PRESSOIR,0180,89110,89196,Valravillon,89,,,89196000AI0291,,,,,,,,,,,,,0,3,Dépendance,,0,S,sols,,,1000,3.425874,47.893756
2021-1520088,2021-09-30,000001,Vente,220000,9000,,IMP DU PETIT PRESSOIR,0180,89110,89196,Valravillon,89,,,89196000AI0291,,,,,,,,,,,,,0,1,Maison,148,5,S,sols,,,1000,3.425874,47.893756
2021-1520088,2021-09-30,000001,Vente,220000,9000,,IMP DU PETIT PRESSOIR,0180,89110,89196,Valravillon,89,,,89196000AI0291,,,,,,,,,,,,,0,3,Dépendance,,0,J,jardins,,,459,3.425874,47.893756
2021-1520698,2021-10-26,000001,Vente,439,,,LES CONSISES PERRUCHOT,B034,89110,89196,Valravillon,89,,,89196000AD0078,,,,,,,,,,,,,0,,,,,T,terres,,,589,3.443861,47.894444
2021-1520698,2021-10-26,000001,Vente,439,,,LES CONSISES PERRUCHOT,B034,89110,89196,Valravillon,89,,,89196000AD0079,,,,,,,,,,,,,0,,,,,T,terres,,,612,3.443301,47.894678
2021-1520698,2021-10-26,000001,Vente,439,,,LES CONSISES PERRUCHOT,B034,89110,89196,Valravillon,89,,,89196000AD0093,,,,,,,,,,,,,0,,,,,T,terres,,,558,3.443663,47.894239
2021-1520699,2021-10-26,000002,Vente,1003,,,LES SAULS,B103,89110,89196,Valravillon,89,,,89196000AB0051,,,,,,,,,,,,,0,,,,,BP,peupleraies,,,146,3.44454,47.902339
2021-1520699,2021-10-26,000002,Vente,1003,,,LES SAULS,B103,89110,89196,Valravillon,89,,,89196000AB0059,,,,,,,,,,,,,0,,,,,BT,taillis simples,AULN,Aulnaie,572,3.444133,47.902851
2021-1520699,2021-10-26,000002,Vente,1003,,,LES SAULS,B103,89110,89196,Valravillon,89,,,89196000AB0067,,,,,,,,,,,,,0,,,,,BP,peupleraies,,,635,3.445119,47.902902
2021-1520699,2021-10-26,000002,Vente,1003,,,LES CONSISES PERRUCHOT,B034,89110,89196,Valravillon,89,,,89196000AD0291,,,,,,,,,,,,,0,,,,,T,terres,,,800,3.443533,47.894183
2021-1520699,2021-10-26,000002,Vente,1003,,,LE LATEUX,B059,89110,89196,Valravillon,89,,,89196000AH0467,,,,,,,,,,,,,0,,,,,T,terres,,,472,3.448106,47.893368
2021-1520699,2021-10-26,000002,Vente,1003,,,LES PRES DE LA MOTTE,B093,89110,89196,Valravillon,89,,,891960000E0035,,,,,,,,,,,,,0,,,,,BT,taillis simples,,,5200,3.431331,47.89191
2021-1520699,2021-10-26,000002,Vente,1003,,,LES PRES SONNEURS,B098,89110,89196,Valravillon,89,,,891960000E0039,,,,,,,,,,,,,0,,,,,BT,taillis simples,AULN,Aulnaie,1329,3.430911,47.892702
2021-1520699,2021-10-26,000002,Vente,1003,,,LES PRES SONNEURS,B098,89110,89196,Valravillon,89,,,891960000E0042,,,,,,,,,,,,,0,,,,,BP,peupleraies,,,775,3.430817,47.892306
2021-1520699,2021-10-26,000002,Vente,1003,,,LA GARENNE GUERCHY,B048,89110,89196,Valravillon,89,,,891960000E0557,,,,,,,,,,,,,0,,,,,BT,taillis simples,,,2534,3.443209,47.883601
2021-1520700,2021-10-29,000001,Vente,165000,139,,LES LATEUX,B058,89110,89196,Valravillon,89,,,89196000AC0099,,,,,,,,,,,,,0,1,Maison,91,3,S,sols,,,448,3.445934,47.898911
2021-1520700,2021-10-29,000001,Vente,165000,139,,LES LATEUX,B058,89110,89196,Valravillon,89,,,89196000AC0099,,,,,,,,,,,,,0,3,Dépendance,,0,S,sols,,,448,3.445934,47.898911
2021-1520700,2021-10-29,000001,Vente,165000,139,,LES LATEUX,B058,89110,89196,Valravillon,89,,,89196000AC0099,,,,,,,,,,,,,0,3,Dépendance,,0,S,sols,,,448,3.445934,47.898911
2021-1520746,2021-11-10,000001,Vente,45000,,,LE VILLAGE SUD,B364,89113,89196,Valravillon,89,,,891962750E1004,,,,,,,,,,,,,0,,,,,S,sols,,,100,3.437783,47.915048
2021-1520746,2021-11-10,000001,Vente,45000,27,,GR GRANDE RUE NEUILLY,0375,89113,89196,Valravillon,89,,,891962750E1006,,,,,,,,,,,,,0,1,Maison,59,2,S,sols,,,354,3.437549,47.915058
2021-1520746,2021-11-10,000001,Vente,45000,27,,GR GRANDE RUE NEUILLY,0375,89113,89196,Valravillon,89,,,891962750E1006,,,,,,,,,,,,,0,3,Dépendance,,0,S,sols,,,354,3.437549,47.915058
2021-1520746,2021-11-10,000001,Vente,45000,,,LE VILLAGE SUD,B364,89113,89196,Valravillon,89,,,891962750E1233,,,,,,,,,,,,,0,,,,,S,sols,,,62,3.437494,47.915126
2021-1520782,2021-11-02,000001,Vente,300,,,LE PRE JOURY,B187,89113,89196,Valravillon,89,,,891962130B0445,,,,,,,,,,,,,0,,,,,BP,peupleraies,,,1575,3.409234,47.878834
2021-1520783,2021-11-02,000002,Vente,900,,,LE PRE JOURY,B187,89113,89196,Valravillon,89,,,891962130B0419,,,,,,,,,,,,,0,,,,,BT,taillis simples,,,1110,3.408563,47.878413
2021-1520783,2021-11-02,000002,Vente,900,,,LE PRE JOURY,B187,89113,89196,Valravillon,89,,,891962130B0420,,,,,,,,,,,,,0,,,,,BT,taillis simples,,,1540,3.409113,47.878366
2021-1520783,2021-11-02,000002,Vente,900,,,LE PRE JOURY,B187,89113,89196,Valravillon,89,,,891962130B0443,,,,,,,,,,,,,0,,,,,BT,taillis simples,,,685,3.410047,47.878389
2021-1520783,2021-11-02,000002,Vente,900,,,LE PRE JOURY,B187,89113,89196,Valravillon,89,,,891962130B0444,,,,,,,,,,,,,0,,,,,BT,taillis simples,,,605,3.40964,47.878531
2021-1520783,2021-11-02,000002,Vente,900,,,LES BEUGNONS,B129,89113,89196,Valravillon,89,,,891962130B1354,,,,,,,,,,,,,0,,,,,T,terres,,,1540,3.421812,47.867944
2021-1520784,2021-11-02,000003,Vente,7800,,,LES REGUINS,B190,89113,89196,Valravillon,89,,,891962130B0214,,,,,,,,,,,,,0,,,,,BT,taillis simples,,,70,3.40989,47.876038
2021-1520784,2021-11-02,000003,Vente,7800,,,LES REGUINS,B190,89113,89196,Valravillon,89,,,891962130B0217,,,,,,,,,,,,,0,,,,,BT,taillis simples,,,465,3.40976,47.875926
2021-1520784,2021-11-02,000003,Vente,7800,,,LES REGUINS,B190,89113,89196,Valravillon,89,,,891962130B0244,,,,,,,,,,,,,0,,,,,BT,taillis simples,,,320,3.409635,47.874888
2021-1520784,2021-11-02,000003,Vente,7800,,,BUTISSE,B132,89113,89196,Valravillon,89,,,891962130B0290,,,,,,,,,,,,,0,,,,,BT,taillis simples,,,470,3.407778,47.873273
2021-1520784,2021-11-02,000003,Vente,7800,,,LE PRE JOURY,B187,89113,89196,Valravillon,89,,,891962130B0421,,,,,,,,,,,,,0,,,,,BT,taillis simples,,,610,3.409421,47.878195
2021-1520784,2021-11-02,000003,Vente,7800,,,LE PRE JOURY,B187,89113,89196,Valravillon,89,,,891962130B0422,,,,,,,,,,,,,0,,,,,BT,taillis simples,,,610,3.409616,47.878166
2021-1520784,2021-11-02,000003,Vente,7800,,,LE PRE JOURY,B187,89113,89196,Valravillon,89,,,891962130B0425,,,,,,,,,,,,,0,,,,,BT,taillis simples,,,500,3.410237,47.878028
2021-1520784,2021-11-02,000003,Vente,7800,,,LE PRE JOURY,B187,89113,89196,Valravillon,89,,,891962130B0446,,,,,,,,,,,,,0,,,,,BT,taillis simples,,,395,3.408818,47.879108
2021-1520784,2021-11-02,000003,Vente,7800,,,LE PRE JOURY,B187,89113,89196,Valravillon,89,,,891962130B0447,,,,,,,,,,,,,0,,,,,BT,taillis simples,,,400,3.408966,47.878805
2021-1520784,2021-11-02,000003,Vente,7800,,,LE PRE JOURY,B187,89113,89196,Valravillon,89,,,891962130B0448,,,,,,,,,,,,,0,,,,,BT,taillis simples,,,400,3.408877,47.878807
2021-1520784,2021-11-02,000003,Vente,7800,,,LE PRE JOURY,B187,89113,89196,Valravillon,89,,,891962130B0449,,,,,,,,,,,,,0,,,,,BT,taillis simples,,,940,3.408811,47.878649
2021-1520784,2021-11-02,000003,Vente,7800,,,LE PRE JOURY,B187,89113,89196,Valravillon,89,,,891962130B0450,,,,,,,,,,,,,0,,,,,BT,taillis simples,,,1030,3.408499,47.87906
2021-1520784,2021-11-02,000003,Vente,7800,,,LE PRE JOURY,B187,89113,89196,Valravillon,89,,,891962130B0451,,,,,,,,,,,,,0,,,,,BT,taillis simples,,,365,3.408433,47.878758
2021-1520784,2021-11-02,000003,Vente,7800,,,LE PRE JOURY,B187,89113,89196,Valravillon,89,,,891962130B0452,,,,,,,,,,,,,0,,,,,BT,taillis simples,,,425,3.408304,47.878792
2021-1520784,2021-11-02,000003,Vente,7800,,,LA FONTAINE SAINT HILAIRE,B157,89113,89196,Valravillon,89,,,891962130B0466,,,,,,,,,,,,,0,,,,,BP,peupleraies,,,375,,
2021-1520784,2021-11-02,000003,Vente,7800,,,LA FONTAINE SAINT HILAIRE,B157,89113,89196,Valravillon,89,,,891962130B0467,,,,,,,,,,,,,0,,,,,BP,peupleraies,,,930,,
2021-1520784,2021-11-02,000003,Vente,7800,,,LA FONTAINE SAINT HILAIRE,B157,89113,89196,Valravillon,89,,,891962130B0468,,,,,,,,,,,,,0,,,,,BP,peupleraies,,,1050,,
2021-1520784,2021-11-02,000003,Vente,7800,,,LA FONTAINE SAINT HILAIRE,B157,89113,89196,Valravillon,89,,,891962130B0469,,,,,,,,,,,,,0,,,,,BP,peupleraies,,,268,,
2021-1520784,2021-11-02,000003,Vente,7800,,,LA FONTAINE SAINT HILAIRE,B157,89113,89196,Valravillon,89,,,891962130B0470,,,,,,,,,,,,,0,,,,,BP,peupleraies,,,402,,
2021-1520784,2021-11-02,000003,Vente,7800,,,LA RUELLE AUX GRENOUILLES,B192,89113,89196,Valravillon,89,,,891962130B0756,,,,,,,,,,,,,0,,,,,BT,taillis simples,,,1660,3.414478,47.878949
2021-1520784,2021-11-02,000003,Vente,7800,,,LA FONTAINE AUX PRETRES,B155,89113,89196,Valravillon,89,,,891962130B0880,,,,,,,,,,,,,0,,,,,BT,taillis simples,,,1168,3.415371,47.877464
2021-1520784,2021-11-02,000003,Vente,7800,,,LA FONTAINE AUX PRETRES,B155,89113,89196,Valravillon,89,,,891962130B0938,,,,,,,,,,,,,0,,,,,BT,taillis simples,,,777,3.415794,47.876359
2021-1520784,2021-11-02,000003,Vente,7800,,,LA FONTAINE AUX PRETRES,B155,89113,89196,Valravillon,89,,,891962130B0941,,,,,,,,,,,,,0,,,,,BT,taillis simples,,,1374,3.415714,47.876703
2021-1520784,2021-11-02,000003,Vente,7800,,,LA FONTAINE AUX PRETRES,B155,89113,89196,Valravillon,89,,,891962130B0943,,,,,,,,,,,,,0,,,,,BT,taillis simples,,,630,3.415476,47.87688
2021-1520784,2021-11-02,000003,Vente,7800,,,LES GRANDES PATURES,B165,89113,89196,Valravillon,89,,,891962130B0949,,,,,,,,,,,,,0,,,,,BT,taillis simples,,,336,3.414362,47.877181
2021-1520784,2021-11-02,000003,Vente,7800,,,LES GRANDES PATURES,B165,89113,89196,Valravillon,89,,,891962130B0958,,,,,,,,,,,,,0,,,,,BT,taillis simples,,,288,3.414591,47.876813
2021-1520784,2021-11-02,000003,Vente,7800,,,LES REGUINS,B190,89113,89196,Valravillon,89,,,891962130B1031,,,,,,,,,,,,,0,,,,,BT,taillis simples,,,480,3.412559,47.876595
2021-1520784,2021-11-02,000003,Vente,7800,,,LES REGUINS,B190,89113,89196,Valravillon,89,,,891962130B1078,,,,,,,,,,,,,0,,,,,BT,taillis simples,,,320,,
2021-1520784,2021-11-02,000003,Vente,7800,,,LES REGUINS,B190,89113,89196,Valravillon,89,,,891962130B1079,,,,,,,,,,,,,0,,,,,BT,taillis simples,,,250,,
2021-1520784,2021-11-02,000003,Vente,7800,,,LES GRANDS PRES LADUZ,B166,89113,89196,Valravillon,89,,,891962130B1951,,,,,,,,,,,,,0,,,,,BP,peupleraies,,,3012,3.417466,47.880736
2021-1520784,2021-11-02,000003,Vente,7800,,,LA RUELLE AUX GRENOUILLES,B192,89113,89196,Valravillon,89,,,891962130B1955,,,,,,,,,,,,,0,,,,,BP,peupleraies,,,3338,3.416051,47.880219
2021-1520784,2021-11-02,000003,Vente,7800,,,LE PRE JOURY,B187,89113,89196,Valravillon,89,,,891962130B1980,,,,,,,,,,,,,0,,,,,BT,taillis simples,,,318,3.408138,47.878819
2021-1520784,2021-11-02,000003,Vente,7800,,,LE PRE JOURY,B187,89113,89196,Valravillon,89,,,891962130B1981,,,,,,,,,,,,,0,,,,,BT,taillis simples,,,318,3.4082,47.878835
2021-1520784,2021-11-02,000003,Vente,7800,,,LE FONTENAY,B158,89113,89196,Valravillon,89,,,891962130C0376,,,,,,,,,,,,,0,,,,,BP,peupleraies,,,1085,3.40901,47.884327
2021-1521109,2021-11-08,000001,Vente,1,19,,RTE DE POILLY,0361,89113,89196,Valravillon,89,,,891962130B2200,,,,,,,,,,,,,0,,,,,J,jardins,,,250,3.407845,47.879219
2021-1521776,2021-12-02,000001,Vente,6058,,,CASSOT,B136,89113,89196,Valravillon,89,,,891962130B0558,,,,,,,,,,,,,0,,,,,T,terres,,,4034,3.413726,47.882401
2021-1521776,2021-12-02,000001,Vente,6058,,,CASSOT,B136,89113,89196,Valravillon,89,,,891962130B0559,,,,,,,,,,,,,0,,,,,BP,peupleraies,,,59,3.414208,47.882711
2021-1521776,2021-12-02,000001,Vente,6058,,,LES BEUGNONS,B129,89113,89196,Valravillon,89,,,891962130B1197,,,,,,,,,,,,,0,,,,,T,terres,,,1244,3.423554,47.872054
2021-1521776,2021-12-02,000001,Vente,6058,,,LES BEUGNONS,B129,89113,89196,Valravillon,89,,,891962130B1198,,,,,,,,,,,,,0,,,,,T,terres,,,3736,3.424494,47.871619
2021-1521776,2021-12-02,000001,Vente,6058,,,LES BEUGNONS,B129,89113,89196,Valravillon,89,,,891962130B1199,,,,,,,,,,,,,0,,,,,T,terres,,,1080,3.425053,47.871378
2021-1521776,2021-12-02,000001,Vente,6058,,,LES LATTEUX LADUZ,B172,89113,89196,Valravillon,89,,,89196213ZC0007,,,,,,,,,,,,,0,,,,,T,terres,,,10040,3.404783,47.875747
2021-1522117,2021-12-14,000001,Vente,487,,,BLENEAU,B210,89113,89196,Valravillon,89,,,891962750C0237,,,,,,,,,,,,,0,,,,,BT,taillis simples,,,775,3.459526,47.912666
2021-1522117,2021-12-14,000001,Vente,487,,,LA MONNEDIOT,B396,89113,89196,Valravillon,89,,,891964570A0410,,,,,,,,,,,,,0,,,,,BT,taillis simples,,,170,3.46721,47.917344
2021-1522117,2021-12-14,000001,Vente,487,,,LA MONNEDIOT,B396,89113,89196,Valravillon,89,,,891964570A0413,,,,,,,,,,,,,0,,,,,BT,taillis simples,,,670,3.466851,47.916966
2021-1522117,2021-12-14,000001,Vente,487,,,LA MONNEDIOT,B396,89113,89196,Valravillon,89,,,891964570A0414,,,,,,,,,,,,,0,,,,,BT,taillis simples,,,680,3.467158,47.916898
2021-1522117,2021-12-14,000001,Vente,487,,,LA MONNEDIOT,B396,89113,89196,Valravillon,89,,,891964570A0440,,,,,,,,,,,,,0,,,,,P,prés,,,1400,3.463291,47.919021
2021-1522117,2021-12-14,000001,Vente,487,,,LA MONNEDIOT,B396,89113,89196,Valravillon,89,,,891964570A0450,,,,,,,,,,,,,0,,,,,P,prés,,,103,3.462969,47.919174
2021-1522117,2021-12-14,000001,Vente,487,,,LES MEZ,B394,89113,89196,Valravillon,89,,,891964570C0039,,,,,,,,,,,,,0,,,,,BT,taillis simples,,,320,3.470491,47.909889
2021-1522117,2021-12-14,000001,Vente,487,,,LES MEZ,B394,89113,89196,Valravillon,89,,,891964570C0043,,,,,,,,,,,,,0,,,,,BT,taillis simples,,,378,3.470586,47.910469
2021-1522118,2021-12-14,000002,Vente,383,,,LE CLOS GLANTIER,B242,89113,89196,Valravillon,89,,,891962750C0645,,,,,,,,,,,,,0,,,,,BT,taillis simples,,,1467,3.455099,47.91215
2021-1522118,2021-12-14,000002,Vente,383,,,LA MONNEDIOT,B396,89113,89196,Valravillon,89,,,891964570A0412,,,,,,,,,,,,,0,,,,,BT,taillis simples,,,1700,3.466532,47.916954
2021-1522118,2021-12-14,000002,Vente,383,,,LES MEZ,B394,89113,89196,Valravillon,89,,,891964570C0037,,,,,,,,,,,,,0,,,,,BT,taillis simples,,,370,3.470549,47.909685
2021-1522429,2021-12-10,000001,Vente,195000,72,,LES CONSISES MARTIN,B033,89110,89196,Valravillon,89,,,89196000AD0140,,,,,,,,,,,,,0,3,Dépendance,,0,S,sols,,,462,3.440154,47.892878
2021-1522429,2021-12-10,000001,Vente,195000,72,,LES CONSISES MARTIN,B033,89110,89196,Valravillon,89,,,89196000AD0140,,,,,,,,,,,,,0,1,Maison,120,6,S,sols,,,462,3.440154,47.892878
2021-1522429,2021-12-10,000001,Vente,195000,,,LES CONSISES MARTIN,B033,89110,89196,Valravillon,89,,,89196000AD0141,,,,,,,,,,,,,0,,,,,J,jardins,,,1470,3.440225,47.892793
2021-1522486,2021-12-21,000001,Vente,156400,8,,CHE DU PRESSOIR,0160,89110,89196,Valravillon,89,,,891960000T0876,,,,,,,,,,,,,0,1,Maison,105,4,S,sols,,,1000,3.42309,47.89405
2021-1522486,2021-12-21,000001,Vente,156400,8,,CHE DU PRESSOIR,0160,89110,89196,Valravillon,89,,,891960000T0876,,,,,,,,,,,,,0,1,Maison,105,4,T,terres,,,200,3.42309,47.89405
2021-1522626,2021-12-29,000001,Vente,2100,,,CHATEAU VERT,B140,89113,89196,Valravillon,89,,,891962130A1242,,,,,,,,,,,,,0,,,,,T,terres,,,425,3.409539,47.888612
2021-1522626,2021-12-29,000001,Vente,2100,,,CHATEAU VERT,B140,89113,89196,Valravillon,89,,,891962130A1243,,,,,,,,,,,,,0,,,,,T,terres,,,519,3.409459,47.888658
2021-1522626,2021-12-29,000001,Vente,2100,,,CHATEAU VERT,B140,89113,89196,Valravillon,89,,,891962130A1418,,,,,,,,,,,,,0,,,,,T,terres,,,1199,3.408943,47.888294
2021-1522626,2021-12-29,000001,Vente,2100,,,CHATEAU VERT,B140,89113,89196,Valravillon,89,,,891962130A1420,,,,,,,,,,,,,0,,,,,T,terres,,,3,3.409434,47.888215
2021-1522626,2021-12-29,000001,Vente,2100,,,CHATEAU VERT,B140,89113,89196,Valravillon,89,,,891962130A1422,,,,,,,,,,,,,0,,,,,T,terres,,,2595,3.409551,47.888408
2021-1522626,2021-12-29,000001,Vente,2100,,,SUR LA CROIX MARCHAND,B147,89113,89196,Valravillon,89,,,89196213ZL0046,,,,,,,,,,,,,0,,,,,T,terres,,,786,3.409441,47.888573
2021-1522631,2021-12-29,000001,Vente,2000,,,LES BEUGNONS,B129,89113,89196,Valravillon,89,,,891962130B1155,,,,,,,,,,,,,0,,,,,BT,taillis simples,,,75,3.420907,47.873355
2021-1522631,2021-12-29,000001,Vente,2000,,,LES BEUGNONS,B129,89113,89196,Valravillon,89,,,891962130B1156,,,,,,,,,,,,,0,,,,,BT,taillis simples,,,1720,3.421499,47.873168
2021-1522631,2021-12-29,000001,Vente,2000,,,LES BEUGNONS,B129,89113,89196,Valravillon,89,,,891962130B1165,,,,,,,,,,,,,0,,,,,BT,taillis simples,,,24,3.420633,47.872845
2021-1522631,2021-12-29,000001,Vente,2000,,,LES BEUGNONS,B129,89113,89196,Valravillon,89,,,891962130B1166,,,,,,,,,,,,,0,,,,,BT,taillis simples,,,674,3.421255,47.872762
2021-1522631,2021-12-29,000001,Vente,2000,,,LES BEUGNONS,B129,89113,89196,Valravillon,89,,,891962130B1350,,,,,,,,,,,,,0,,,,,T,terres,,,2610,3.422079,47.868156
2021-1522631,2021-12-29,000001,Vente,2000,,,LES BEUGNONS,B129,89113,89196,Valravillon,89,,,891962130B1351,,,,,,,,,,,,,0,,,,,T,terres,,,930,3.422208,47.868078
2021-1522631,2021-12-29,000001,Vente,2000,,,LES BEUGNONS,B129,89113,89196,Valravillon,89,,,891962130B1352,,,,,,,,,,,,,0,,,,,T,terres,,,790,3.422052,47.868047
2021-1522631,2021-12-29,000001,Vente,2000,,,LES BEUGNONS,B129,89113,89196,Valravillon,89,,,891962130B1353,,,,,,,,,,,,,0,,,,,T,terres,,,1065,3.421948,47.868009
2021-1522731,2021-12-29,000001,Vente,138000,,,LE CUL DE SAC NEUILLY,B250,89113,89196,Valravillon,89,,,89196275ZB0001,,,,,,,,,,,,,0,,,,,BT,taillis simples,,,2730,3.453924,47.901444
2021-1522731,2021-12-29,000001,Vente,138000,,,LE CUL DE SAC NEUILLY,B250,89113,89196,Valravillon,89,,,89196275ZB0001,,,,,,,,,,,,,0,,,,,T,terres,,,45470,3.453924,47.901444
2021-1522731,2021-12-29,000001,Vente,138000,,,LE CORMIER JUSSON,B243,89113,89196,Valravillon,89,,,89196275ZB0012,,,,,,,,,,,,,0,,,,,T,terres,,,860,3.456894,47.902092
2021-1522731,2021-12-29,000001,Vente,138000,,,LES TEURRES,B111,89110,89196,Valravillon,89,,,89196000AB0078,,,,,,,,,,,,,0,,,,,P,prés,,,12415,3.444737,47.901394
2021-1522731,2021-12-29,000001,Vente,138000,,,LES TEURRES,B111,89110,89196,Valravillon,89,,,89196000AB0079,,,,,,,,,,,,,0,,,,,BP,peupleraies,,,595,3.443862,47.900903
2021-1522731,2021-12-29,000001,Vente,138000,,,LE HAUT DES TEURRES,B056,89110,89196,Valravillon,89,,,89196000AC0046,,,,,,,,,,,,,0,,,,,P,prés,,,7298,3.445749,47.901139
2021-1522731,2021-12-29,000001,Vente,138000,143,,LE HAUT DES TEURRES,B056,89110,89196,Valravillon,89,,,89196000AC0047,,,,,,,,,,,,,0,1,Maison,62,2,S,sols,,,3405,3.446297,47.900673
2021-1522731,2021-12-29,000001,Vente,138000,143,,LE HAUT DES TEURRES,B056,89110,89196,Valravillon,89,,,89196000AC0047,,,,,,,,,,,,,0,1,Maison,114,4,S,sols,,,3405,3.446297,47.900673
2021-1522731,2021-12-29,000001,Vente,138000,,,CHATEAU DE CORDEIL,B028,89110,89196,Valravillon,89,,,89196000AC0074,,,,,,,,,,,,,0,,,,,S,sols,,,1018,3.446907,47.900632
2021-1522731,2021-12-29,000001,Vente,138000,,,CHATEAU DE CORDEIL,B028,89110,89196,Valravillon,89,,,89196000AC0075,,,,,,,,,,,,,0,,,,,T,terres,,,1112,3.447234,47.90066
2021-1522731,2021-12-29,000001,Vente,138000,,,CHATEAU DE CORDEIL,B028,89110,89196,Valravillon,89,,,89196000AC0077,,,,,,,,,,,,,0,,,,,T,terres,,,15752,3.448585,47.900129
2021-1522731,2021-12-29,000001,Vente,138000,,,CHATEAU DE CORDEIL,B028,89110,89196,Valravillon,89,,,89196000AC0078,,,,,,,,,,,,,0,,,,,T,terres,,,730,3.44773,47.900124
2021-1522731,2021-12-29,000001,Vente,138000,,,LE LIEU BOURDON,B062,89110,89196,Valravillon,89,,,89196000AH0344,,,,,,,,,,,,,0,,,,,T,terres,,,362,3.443429,47.886889
2021-1522731,2021-12-29,000001,Vente,138000,,,LE LIEU BOURDON,B062,89110,89196,Valravillon,89,,,89196000AH0346,,,,,,,,,,,,,0,,,,,T,terres,,,310,3.443609,47.886144
2021-1522731,2021-12-29,000001,Vente,138000,,,TERRES DU BOIS,B110,89110,89196,Valravillon,89,,,891960000V0018,,,,,,,,,,,,,0,,,,,T,terres,,,8790,3.448841,47.887955
2021-1522731,2021-12-29,000001,Vente,138000,,,LE VIGNOT,B122,89110,89196,Valravillon,89,,,891960000W0007,,,,,,,,,,,,,0,,,,,T,terres,,,26040,3.451428,47.898726
2021-1522731,2021-12-29,000001,Vente,138000,,,GENETTE,B050,89110,89196,Valravillon,89,,,891960000W0016,,,,,,,,,,,,,0,,,,,T,terres,,,15390,3.454205,47.897546
2021-1522731,2021-12-29,000001,Vente,138000,,,GENETTE,B050,89110,89196,Valravillon,89,,,891960000W0017,,,,,,,,,,,,,0,,,,,T,terres,,,7650,3.454421,47.896978
2021-1522731,2021-12-29,000001,Vente,138000,,,LE VIGNOT,B122,89110,89196,Valravillon,89,,,891960000W0123,,,,,,,,,,,,,0,,,,,T,terres,,,1380,3.452763,47.898813
2021-1522731,2021-12-29,000001,Vente,138000,,,LE VIGNOT,B122,89110,89196,Valravillon,89,,,891960000W0128,,,,,,,,,,,,,0,,,,,T,terres,,,7595,3.451805,47.898274
2021-1522731,2021-12-29,000001,Vente,138000,,,LE VIGNOT,B122,89110,89196,Valravillon,89,,,891960000W0129,,,,,,,,,,,,,0,,,,,T,terres,,,1738,3.452658,47.898187
2021-1522731,2021-12-29,000001,Vente,138000,,,LE MURIER,B070,89110,89196,Valravillon,89,,,891960000X0292,,,,,,,,,,,,,0,,,,,T,terres,,,2110,3.406247,47.896465
2021-1524043,2021-01-15,000001,Vente,55200,,,LA LAYE,B173,89113,89196,Valravillon,89,,,891962130C0985,,,,,,,,,,,,,0,,,,,T,terres,,,156,3.412595,47.885716
2021-1524043,2021-01-15,000001,Vente,55200,13,,RUE DE LA LAYE,0357,89113,89196,Valravillon,89,,,891962130C1005,,,,,,,,,,,,,0,1,Maison,51,3,S,sols,,,162,3.412415,47.885897
2021-1524088,2021-01-26,000001,Vente,900,,,LES BAREAUX,B003,89110,89196,Valravillon,89,,,89196000AI0137,,,,,,,,,,,,,0,,,,,T,terres,,,372,3.425074,47.893252
2021-1524106,2021-01-23,000001,Vente,500,,,SOUS LES TERRES DE RENTE,B105,89110,89196,Valravillon,89,,,89196000AH0135,,,,,,,,,,,,,0,,,,,T,terres,,,742,3.440745,47.888239
2021-1524106,2021-01-23,000001,Vente,500,,,TERRES DE LA GARENNE,B106,89110,89196,Valravillon,89,,,89196000AH0329,,,,,,,,,,,,,0,,,,,BT,taillis simples,,,290,3.441868,47.886782
2021-1524108,2021-01-23,000001,Vente,112900,11,,RUE NEUVE,0380,89113,89196,Valravillon,89,,,891962750E1046,,,,,,,,,,,,,0,1,Maison,64,4,S,sols,,,440,3.435883,47.915342
2021-1524108,2021-01-23,000001,Vente,112900,,,LA POTERNE SUD,B324,89113,89196,Valravillon,89,,,891962750E1507,,,,,,,,,,,,,0,,,,,AG,terrains d'agrément,,,65,3.435277,47.915541