id_mutation,date_mutation,numero_disposition,nature_mutation,valeur_fonciere,adresse_numero,adresse_suffixe,adresse_nom_voie,adresse_code_voie,code_postal,code_commune,nom_commune,code_departement,ancien_code_commune,ancien_nom_commune,id_parcelle,ancien_id_parcelle,numero_volume,lot1_numero,lot1_surface_carrez,lot2_numero,lot2_surface_carrez,lot3_numero,lot3_surface_carrez,lot4_numero,lot4_surface_carrez,lot5_numero,lot5_surface_carrez,nombre_lots,code_type_local,type_local,surface_reelle_bati,nombre_pieces_principales,code_nature_culture,nature_culture,code_nature_culture_speciale,nature_culture_speciale,surface_terrain,longitude,latitude
2021-1519898,2021-09-18,000001,Vente,140000,22,,CHE DES COMMETIERES,0090,89440,89208,Joux-la-Ville,89,,,89208000ZW0246,,,,,,,,,,,,,0,1,Maison,139,6,AG,terrains d'agrément,,,901,3.864936,47.617893
2021-1519898,2021-09-18,000001,Vente,140000,,,BOIS DE COMMETIERES,B008,89440,89208,Joux-la-Ville,89,,,89208000ZW0252,,,,,,,,,,,,,0,,,,,AG,terrains d'agrément,,,156,3.864556,47.61768
2021-1520222,2021-10-22,000001,Vente,124990,2,,PL DE LA FONTAINE,0180,89440,89208,Joux-la-Ville,89,,,89208000AL0221,,,,,,,,,,,,,0,3,Dépendance,,0,S,sols,,,528,3.862236,47.621852
2021-1520222,2021-10-22,000001,Vente,124990,2,,PL DE LA FONTAINE,0180,89440,89208,Joux-la-Ville,89,,,89208000AL0221,,,,,,,,,,,,,0,1,Maison,96,5,S,sols,,,528,3.862236,47.621852
2021-1520222,2021-10-22,000001,Vente,124990,2,,PL DE LA FONTAINE,0180,89440,89208,Joux-la-Ville,89,,,89208000AL0221,,,,,,,,,,,,,0,3,Dépendance,,0,S,sols,,,528,3.862236,47.621852
2021-1520442,2021-10-29,000001,Vente,120000,9,,RTE DEPARTEMENTALE 944,0161,89440,89208,Joux-la-Ville,89,,,89208000AK0143,,,,,,,,,,,,,0,1,Maison,74,3,S,sols,,,400,3.863598,47.608359
2021-1520442,2021-10-29,000001,Vente,120000,,,LE PUITS D EDME,B241,89440,89208,Joux-la-Ville,89,,,89208000AK0230,,,,,,,,,,,,,0,,,,,T,terres,,,4873,3.86378,47.608284
2021-1522080,2021-12-16,000001,Vente,51500,,,LE VILLAGE,B330,89440,89208,Joux-la-Ville,89,,,89208000AL0198,,,,,,,,,,,,,0,,,,,J,jardins,,,554,3.863663,47.62088
2021-1522080,2021-12-16,000001,Vente,51500,12,,RUE DES PROMENADES,0320,89440,89208,Joux-la-Ville,89,,,89208000AL0199,,,,,,,,,,,,,0,3,Dépendance,,0,S,sols,,,315,3.864023,47.620871
2021-1522080,2021-12-16,000001,Vente,51500,12,,RUE DES PROMENADES,0320,89440,89208,Joux-la-Ville,89,,,89208000AL0199,,,,,,,,,,,,,0,1,Maison,66,3,S,sols,,,315,3.864023,47.620871
2021-1522080,2021-12-16,000001,Vente,51500,,,LE VILLAGE,B330,89440,89208,Joux-la-Ville,89,,,89208000AL0783,,,,,,,,,,,,,0,,,,,P,prés,,,494,3.863228,47.620949
2021-1522112,2021-12-23,000001,Vente,40000,33,,GR GRANDE RUE,0200,89440,89208,Joux-la-Ville,89,,,89208000AL0389,,,,,,,,,,,,,0,1,Maison,145,7,S,sols,,,348,3.861204,47.622007
2021-1522112,2021-12-23,000001,Vente,40000,,,LE VILLAGE,B330,89440,89208,Joux-la-Ville,89,,,89208000AL0719,,,,,,,,,,,,,0,,,,,J,jardins,,,715,3.867038,47.622009
2021-1522586,2021-12-23,000001,Vente,24000,,,LE VILLAGE,B330,89440,89208,Joux-la-Ville,89,,,89208000AL0287,,,,,,,,,,,,,0,,,,,J,jardins,,,605,3.861678,47.621639
2021-1522586,2021-12-23,000001,Vente,24000,,,LE VILLAGE,B330,89440,89208,Joux-la-Ville,89,,,89208000AL0288,,,,,,,,,,,,,0,,,,,S,sols,,,38,3.861602,47.621733
2021-1522586,2021-12-23,000001,Vente,24000,30,,GR GRANDE RUE,0200,89440,89208,Joux-la-Ville,89,,,89208000AL0602,,,,,,,,,,,,,0,3,Dépendance,,0,S,sols,,,117,3.86152,47.621696
2021-1522832,2021-01-25,000001,Vente,300,,,LE PUITS D EDME,B241,89440,89208,Joux-la-Ville,89,,,89208000AK0213,,,,,,,,,,,,,0,,,,,T,terres,,,58,3.862838,47.608049
2021-1522832,2021-01-25,000001,Vente,300,,,LE PUITS D EDME,B241,89440,89208,Joux-la-Ville,89,,,89208000AK0219,,,,,,,,,,,,,0,,,,,S,sols,,,20,3.863044,47.607965
2021-1523293,2021-04-30,000002,Vente,10185,,,SUR LE FAUBOURG,B146,89440,89208,Joux-la-Ville,89,,,89208000ZW0323,,,,,,,,,,,,,0,,,,,T,terres,,,679,3.866478,47.619322
2021-1523299,2021-05-03,000001,Vente,47010,41,,GR GRANDE RUE,0200,89440,89208,Joux-la-Ville,89,,,89208000AL0801,,,,,,,,,,,,,0,1,Maison,112,5,S,sols,,,435,3.861309,47.622598
2021-1523346,2021-05-28,000001,Vente,49000,52,,GR GRANDE RUE,0200,89440,89208,Joux-la-Ville,89,,,89208000AL0352,,,,,,,,,,,,,0,1,Maison,84,4,S,sols,,,230,3.862239,47.623323
2021-1523593,2021-07-01,000001,Vente,55000,,,LE VILLAGE,B330,89440,89208,Joux-la-Ville,89,,,89208000AL0461,,,,,,,,,,,,,0,,,,,S,sols,,,149,3.862447,47.622257
2021-1523593,2021-07-01,000001,Vente,55000,9005,,RUE DE L EGLISE,0150,89440,89208,Joux-la-Ville,89,,,89208000AL0462,,,,,,,,,,,,,0,1,Maison,63,3,S,sols,,,45,3.862399,47.622224
2021-1523596,2021-07-06,000001,Vente,3000,,,LES TREMBLATS,B274,89440,89208,Joux-la-Ville,89,,,89208000XK0065,,,,,,,,,,,,,0,,,,,L,landes,,,1200,3.869067,47.592986
2021-1523596,2021-07-06,000001,Vente,3000,,,LA JARRIE,B186,89440,89208,Joux-la-Ville,89,,,89208000YO0038,,,,,,,,,,,,,0,,,,,T,terres,,,7187,3.873459,47.639387
2021-1523596,2021-07-06,000001,Vente,3000,,,LA JARRIE,B186,89440,89208,Joux-la-Ville,89,,,89208000YO0063,,,,,,,,,,,,,0,,,,,L,landes,,,562,3.873364,47.640103
2021-1523596,2021-07-06,000001,Vente,3000,,,LA JARRIE,B186,89440,89208,Joux-la-Ville,89,,,89208000YO0064,,,,,,,,,,,,,0,,,,,T,terres,,,3384,3.873934,47.639423
2021-1523596,2021-07-06,000001,Vente,3000,,,LE FOUCEAU,B153,89440,89208,Joux-la-Ville,89,,,89208000YW0021,,,,,,,,,,,,,0,,,,,BS,taillis sous futaie,,,9345,3.908045,47.633803
2021-1523596,2021-07-06,000001,Vente,3000,,,LE FOUCEAU,B153,89440,89208,Joux-la-Ville,89,,,89208000YW0025,,,,,,,,,,,,,0,,,,,BT,taillis simples,,,10326,3.906001,47.629479
2021-1523619,2021-07-19,000001,Vente,109990,3,,RUE ROUGNON,0360,89440,89208,Joux-la-Ville,89,,,89208000AL0373,,,,,,,,,,,,,0,1,Maison,95,4,S,sols,,,237,3.860908,47.622981
2021-1523820,2021-07-30,000001,Vente,25000,,,CHAMPS DE LA VALLEE,B067,89440,89208,Joux-la-Ville,89,,,892080000E0223,,,,,,,,,,,,,0,,,,,L,landes,,,1915,3.884603,47.589731
2021-1523820,2021-07-30,000001,Vente,25000,,,CHAMPS DE LA VALLEE,B067,89440,89208,Joux-la-Ville,89,,,892080000E0224,,,,,,,,,,,,,0,,,,,BT,taillis simples,,,5165,3.884486,47.589206
2021-1523820,2021-07-30,000001,Vente,25000,,,CHAMPS DE LA VALLEE,B067,89440,89208,Joux-la-Ville,89,,,892080000E0225,,,,,,,,,,,,,0,,,,,BT,taillis simples,,,5165,3.884049,47.589101
2021-1523820,2021-07-30,000001,Vente,25000,,,CHAMPS DE LA VALLEE,B067,89440,89208,Joux-la-Ville,89,,,892080000E0228,,,,,,,,,,,,,0,,,,,L,landes,,,1950,3.883834,47.587996
2021-1523820,2021-07-30,000001,Vente,25000,,,LE GROS BOUCHON,B174,89440,89208,Joux-la-Ville,89,,,892080000E0285,,,,,,,,,,,,,0,,,,,BT,taillis simples,,,5125,3.883527,47.587796
