id_mutation,date_mutation,numero_disposition,nature_mutation,valeur_fonciere,adresse_numero,adresse_suffixe,adresse_nom_voie,adresse_code_voie,code_postal,code_commune,nom_commune,code_departement,ancien_code_commune,ancien_nom_commune,id_parcelle,ancien_id_parcelle,numero_volume,lot1_numero,lot1_surface_carrez,lot2_numero,lot2_surface_carrez,lot3_numero,lot3_surface_carrez,lot4_numero,lot4_surface_carrez,lot5_numero,lot5_surface_carrez,nombre_lots,code_type_local,type_local,surface_reelle_bati,nombre_pieces_principales,code_nature_culture,nature_culture,code_nature_culture_speciale,nature_culture_speciale,surface_terrain,longitude,latitude
2021-1518764,2021-06-24,000001,Vente,228000,4,,LES MIGNONS,B065,89130,89217,Lalande,89,,,89217000ZE0062,,,,,,,,,,,,,0,1,Maison,84,4,S,sols,,,735,3.319202,47.688928
2021-1518764,2021-06-24,000001,Vente,228000,4,,LES MIGNONS,B065,89130,89217,Lalande,89,,,89217000ZE0062,,,,,,,,,,,,,0,3,Dépendance,,0,S,sols,,,735,3.319202,47.688928
2021-1518824,2021-07-06,000001,Vente,100000,8,,LES RAMEAUX,B089,89130,89217,Lalande,89,,,89217000ZI0039,,,,,,,,,,,,,0,1,Maison,82,3,T,terres,,,397,3.34143,47.67757
2021-1518824,2021-07-06,000001,Vente,100000,8,,LES RAMEAUX,B089,89130,89217,Lalande,89,,,89217000ZI0039,,,,,,,,,,,,,0,1,Maison,82,3,S,sols,,,400,3.34143,47.67757
2021-1522713,2021-12-29,000001,Vente,188580,80,A,CHATEAU DE LALANDE,B037,89130,89217,Lalande,89,,,89217000ZI0049,,,,,,,,,,,,,0,1,Maison,231,8,S,sols,,,157,3.3222,47.678291
2021-1522713,2021-12-29,000001,Vente,188580,80,A,CHATEAU DE LALANDE,B037,89130,89217,Lalande,89,,,89217000ZI0049,,,,,,,,,,,,,0,3,Dépendance,,0,S,sols,,,157,3.3222,47.678291
2021-1522713,2021-12-29,000001,Vente,188580,80,A,CHATEAU DE LALANDE,B037,89130,89217,Lalande,89,,,89217000ZI0049,,,,,,,,,,,,,0,3,Dépendance,,0,S,sols,,,157,3.3222,47.678291
2021-1522713,2021-12-29,000001,Vente,188580,10,,CHE DU COMTE DE LACELLE,0005,89130,89217,Lalande,89,,,89217000ZI0050,,,,,,,,,,,,,0,,,,,S,sols,,,1359,3.322165,47.678256
