id_mutation,date_mutation,numero_disposition,nature_mutation,valeur_fonciere,adresse_numero,adresse_suffixe,adresse_nom_voie,adresse_code_voie,code_postal,code_commune,nom_commune,code_departement,ancien_code_commune,ancien_nom_commune,id_parcelle,ancien_id_parcelle,numero_volume,lot1_numero,lot1_surface_carrez,lot2_numero,lot2_surface_carrez,lot3_numero,lot3_surface_carrez,lot4_numero,lot4_surface_carrez,lot5_numero,lot5_surface_carrez,nombre_lots,code_type_local,type_local,surface_reelle_bati,nombre_pieces_principales,code_nature_culture,nature_culture,code_nature_culture_speciale,nature_culture_speciale,surface_terrain,longitude,latitude
2021-1520119,2021-10-07,000001,Vente,220000,9,,RUE DE LA CONTROLERIE,0060,89510,89291,Passy,89,,,89291000AA0318,,,,,,,,,,,,,0,1,Maison,120,4,AB,terrains a bâtir,,,622,3.303078,48.111136
2021-1520119,2021-10-07,000001,Vente,220000,,,RUE DE LA CONTROLERIE,0060,89510,89291,Passy,89,,,89291000AA0321,,,,,,,,,,,,,0,,,,,AG,terrains d'agrément,,,6,3.303464,48.111405
2021-1520119,2021-10-07,000001,Vente,220000,,,RUE DE LA CONTROLERIE,0060,89510,89291,Passy,89,,,89291000AA0330,,,,,,,,,,,,,0,,,,,AB,terrains a bâtir,,,124,3.303076,48.110988
2021-1521869,2021-12-15,000001,Vente,73000,150,,LE CHATEAU,B011,89510,89291,Passy,89,,,89291000ZI0085,,,133,,,,,,,,,,1,3,Dépendance,,0,,,,,,3.307717,48.113169
2021-1521869,2021-12-15,000001,Vente,73000,150,,LE CHATEAU,B011,89510,89291,Passy,89,,,89291000ZI0085,,,101,59.14,,,,,,,,,1,2,Appartement,56,2,,,,,,3.307717,48.113169
2021-1521869,2021-12-15,000001,Vente,73000,150,,LE CHATEAU,B011,89510,89291,Passy,89,,,89291000ZI0085,,,134,,,,,,,,,,1,3,Dépendance,,0,,,,,,3.307717,48.113169
2021-1522418,2021-12-14,000001,Vente,43000,17,,RUE DU BOIS DE BAILLY,0023,89510,89291,Passy,89,,,89291000AB0089,,,,,,,,,,,,,0,1,Maison,61,3,S,sols,,,384,,
2021-1526205,2021-02-19,000002,Vente,190000,,,CHEM DE LA COTE AUX PIGEONS,0080,89510,89291,Passy,89,,,89291000AA0072,,,,,,,,,,,,,0,,,,,VE,vergers,,,334,3.29921,48.111001
2021-1526227,2021-02-15,000001,Vente,280000,5,,RUE DU PARC,0225,89510,89291,Passy,89,,,89291000AA0094,,,,,,,,,,,,,0,1,Maison,200,8,AG,terrains d'agrément,,,1184,3.299528,48.11199
2021-1526227,2021-02-15,000001,Vente,280000,5,,RUE DU PARC,0225,89510,89291,Passy,89,,,89291000AA0094,,,,,,,,,,,,,0,1,Maison,200,8,AG,terrains d'agrément,,,1683,3.299528,48.11199
2021-1526227,2021-02-15,000001,Vente,280000,5,,RUE DU PARC,0225,89510,89291,Passy,89,,,89291000AA0094,,,,,,,,,,,,,0,1,Maison,200,8,S,sols,,,2488,3.299528,48.11199
2021-1526519,2021-03-25,000001,Vente,1,30,,GR GRANDE RUE,0095,89510,89291,Passy,89,,,89291000AA0332,,,,,,,,,,,,,0,1,Maison,210,5,,,,,,3.299004,48.110816
2021-1526534,2021-04-02,000001,Vente,61000,4,,RUE DE LA CONTROLERIE,0060,89510,89291,Passy,89,,,89291000AA0127,,,,,,,,,,,,,0,1,Maison,74,4,S,sols,,,300,3.30418,48.111238
2021-1526601,2021-04-09,000001,Vente,155000,31,,GR GRANDE RUE,0095,89510,89291,Passy,89,,,89291000AA0047,,,,,,,,,,,,,0,1,Maison,105,4,S,sols,,,624,3.299292,48.110168
2021-1527079,2021-06-29,000001,Vente,140000,4,,RUE DE LA RESISTANCE,0250,89510,89291,Passy,89,,,89291000AA0041,,,,,,,,,,,,,0,1,Maison,180,5,S,sols,,,117,3.300145,48.110164
2021-1527079,2021-06-29,000001,Vente,140000,4,,RUE DE LA RESISTANCE,0250,89510,89291,Passy,89,,,89291000AA0042,,,,,,,,,,,,,0,,,,,S,sols,,,58,3.300123,48.110214
2021-1527231,2021-07-19,000001,Vente,80859.2,,,LE CHENE,B012,89510,89291,Passy,89,,,89291000AA0098,,,,,,,,,,,,,0,,,,,T,terres,,,427,3.299499,48.113133
2021-1527231,2021-07-19,000001,Vente,80859.2,,,LES GRAVIERS,B022,89510,89291,Passy,89,,,89291000ZA0007,,,,,,,,,,,,,0,,,,,E,eaux,ETANG,Etangs,20060,3.275766,48.113668
2021-1527231,2021-07-19,000001,Vente,80859.2,,,LES GRAVIERS,B022,89510,89291,Passy,89,,,89291000ZA0010,,,,,,,,,,,,,0,,,,,AG,terrains d'agrément,,,22440,3.276186,48.11514
2021-1527231,2021-07-19,000001,Vente,80859.2,,,LES GRAVIERS,B022,89510,89291,Passy,89,,,89291000ZA0010,,,,,,,,,,,,,0,,,,,E,eaux,ETANG,Etangs,21700,3.276186,48.11514
2021-1527231,2021-07-19,000001,Vente,80859.2,,,LES GRAVIERS,B022,89510,89291,Passy,89,,,89291000ZA0010,,,,,,,,,,,,,0,,,,,E,eaux,ETANG,Etangs,43700,3.276186,48.11514
2021-1527231,2021-07-19,000001,Vente,80859.2,,,LES GRAVIERS,B022,89510,89291,Passy,89,,,89291000ZA0010,,,,,,,,,,,,,0,,,,,E,eaux,ETANG,Etangs,10800,3.276186,48.11514
2021-1527231,2021-07-19,000001,Vente,80859.2,,,LES GRANDES NOUES,B019,89510,89291,Passy,89,,,89291000ZE0004,,,,,,,,,,,,,0,,,,,S,sols,,,15632,3.286725,48.120342
2021-1527231,2021-07-19,000001,Vente,80859.2,,,LES SABLONS,B034,89510,89291,Passy,89,,,89291000ZE0010,,,,,,,,,,,,,0,,,,,T,terres,,,4126,3.288247,48.116944
2021-1527231,2021-07-19,000001,Vente,80859.2,,,LES SABLONS,B034,89510,89291,Passy,89,,,89291000ZE0011,,,,,,,,,,,,,0,,,,,T,terres,,,5747,3.288563,48.116644
2021-1527231,2021-07-19,000001,Vente,80859.2,,,LES SABLONS,B034,89510,89291,Passy,89,,,89291000ZE0012,,,,,,,,,,,,,0,,,,,T,terres,,,1150,3.288084,48.116618
2021-1527231,2021-07-19,000001,Vente,80859.2,,,LES SABLONS,B034,89510,89291,Passy,89,,,89291000ZE0014,,,,,,,,,,,,,0,,,,,T,terres,,,3702,3.288027,48.116465
2021-1527231,2021-07-19,000001,Vente,80859.2,,,LES SABLONS,B034,89510,89291,Passy,89,,,89291000ZE0015,,,,,,,,,,,,,0,,,,,T,terres,,,6271,3.287892,48.116205
2021-1527231,2021-07-19,000001,Vente,80859.2,,,LES SABLONS,B034,89510,89291,Passy,89,,,89291000ZE0025,,,,,,,,,,,,,0,,,,,CA,carrières,SABLE,Sablière,9430,3.289249,48.119352
2021-1527231,2021-07-19,000001,Vente,80859.2,,,LES SABLONS,B034,89510,89291,Passy,89,,,89291000ZE0025,,,,,,,,,,,,,0,,,,,T,terres,,,4763,3.289249,48.119352
2021-1527231,2021-07-19,000001,Vente,80859.2,,,LES SABLONS,B034,89510,89291,Passy,89,,,89291000ZE0026,,,,,,,,,,,,,0,,,,,CA,carrières,SABLE,Sablière,2525,3.289741,48.118831
2021-1527231,2021-07-19,000001,Vente,80859.2,,,LES SABLONS,B034,89510,89291,Passy,89,,,89291000ZE0027,,,,,,,,,,,,,0,,,,,CA,carrières,SABLE,Sablière,200,3.288874,48.119051
2021-1527231,2021-07-19,000001,Vente,80859.2,,,LES SABLONS,B034,89510,89291,Passy,89,,,89291000ZE0028,,,,,,,,,,,,,0,,,,,CA,carrières,SABLE,Sablière,1520,3.288289,48.119178
2021-1527231,2021-07-19,000001,Vente,80859.2,,,LES SABLONS,B034,89510,89291,Passy,89,,,89291000ZE0029,,,,,,,,,,,,,0,,,,,CA,carrières,SABLE,Sablière,2082,3.289373,48.118722
2021-1527231,2021-07-19,000001,Vente,80859.2,,,LES SABLONS,B034,89510,89291,Passy,89,,,89291000ZE0030,,,,,,,,,,,,,0,,,,,T,terres,,,1538,3.28812,48.119059
2021-1527231,2021-07-19,000001,Vente,80859.2,,,LES SABLONS,B034,89510,89291,Passy,89,,,89291000ZE0032,,,,,,,,,,,,,0,,,,,T,terres,,,709,3.288961,48.118565
2021-1527231,2021-07-19,000001,Vente,80859.2,,,LES SABLONS,B034,89510,89291,Passy,89,,,89291000ZE0034,,,,,,,,,,,,,0,,,,,T,terres,,,599,3.288581,48.118455
2021-1527231,2021-07-19,000001,Vente,80859.2,,,LES SABLONS,B034,89510,89291,Passy,89,,,89291000ZE0034,,,,,,,,,,,,,0,,,,,CA,carrières,SABLE,Sablière,500,3.288581,48.118455
2021-1527231,2021-07-19,000001,Vente,80859.2,,,LES SABLONS,B034,89510,89291,Passy,89,,,89291000ZE0035,,,,,,,,,,,,,0,,,,,CA,carrières,SABLE,Sablière,1510,3.289299,48.118183
2021-1527231,2021-07-19,000001,Vente,80859.2,,,LES SABLONS,B034,89510,89291,Passy,89,,,89291000ZE0035,,,,,,,,,,,,,0,,,,,T,terres,,,914,3.289299,48.118183
2021-1527231,2021-07-19,000001,Vente,80859.2,,,LES GRAVIERS,B022,89510,89291,Passy,89,,,89291000ZL0002,,,,,,,,,,,,,0,,,,,T,terres,,,12136,3.273047,48.114044
2021-1527231,2021-07-19,000001,Vente,80859.2,,,LES GRAVIERS,B022,89510,89291,Passy,89,,,89291000ZL0004,,,,,,,,,,,,,0,,,,,E,eaux,ETANG,Etangs,11200,3.276744,48.113555
2021-1527231,2021-07-19,000001,Vente,80859.2,,,LES GRAVIERS,B022,89510,89291,Passy,89,,,89291000ZL0005,,,,,,,,,,,,,0,,,,,E,eaux,ETANG,Etangs,6438,3.277247,48.113394
2021-1527612,2021-08-24,000001,Vente,98000,11,,RUE DE LA RESISTANCE,0250,89510,89291,Passy,89,,,89291000AA0211,,,,,,,,,,,,,0,4,Local industriel. commercial ou assimilé,175,0,S,sols,,,177,3.300541,48.109224
2021-1527612,2021-08-24,000001,Vente,98000,11,,RUE DE LA RESISTANCE,0250,89510,89291,Passy,89,,,89291000AA0212,,,,,,,,,,,,,0,,,,,J,jardins,,,108,3.300476,48.109042
2021-1527716,2021-09-20,000001,Vente,70000,,,LA GRANDE PIECE,B018,89510,89291,Passy,89,,,89291000ZA0116,,,,,,,,,,,,,0,,,,,CA,carrières,SABLE,Sablière,3655,3.281072,48.118308
2021-1527716,2021-09-20,000001,Vente,70000,,,LA GRANDE PIECE,B018,89510,89291,Passy,89,,,89291000ZA0117,,,,,,,,,,,,,0,,,,,T,terres,,,535,3.281125,48.118959
2021-1527716,2021-09-20,000001,Vente,70000,,,LA GRANDE PIECE,B018,89510,89291,Passy,89,,,89291000ZA0154,,,,,,,,,,,,,0,,,,,S,sols,,,1514,3.28136,48.118182
2021-1527716,2021-09-20,000001,Vente,70000,,,LA GRANDE PIECE,B018,89510,89291,Passy,89,,,89291000ZA0155,,,,,,,,,,,,,0,,,,,S,sols,,,121,3.281356,48.118008
2021-1527716,2021-09-20,000001,Vente,70000,,,LA GRANDE PIECE,B018,89510,89291,Passy,89,,,89291000ZA0156,,,,,,,,,,,,,0,,,,,S,sols,,,410,3.281676,48.118392
2021-1527716,2021-09-20,000001,Vente,70000,,,LA GRANDE PIECE,B018,89510,89291,Passy,89,,,89291000ZA0157,,,,,,,,,,,,,0,,,,,S,sols,,,155,3.281423,48.117999
2021-1527716,2021-09-20,000001,Vente,70000,,,LA GRANDE PIECE,B018,89510,89291,Passy,89,,,89291000ZA0158,,,,,,,,,,,,,0,,,,,S,sols,,,982,3.281798,48.118262
2021-1527716,2021-09-20,000001,Vente,70000,,,LA GRANDE PIECE,B018,89510,89291,Passy,89,,,89291000ZA0159,,,,,,,,,,,,,0,,,,,S,sols,,,478,3.281583,48.117928
2021-1527716,2021-09-20,000001,Vente,70000,,,LA GRANDE PIECE,B018,89510,89291,Passy,89,,,89291000ZA0160,,,,,,,,,,,,,0,,,,,S,sols,,,1060,3.282121,48.118257
2021-1527716,2021-09-20,000001,Vente,70000,,,LA GRANDE PIECE,B018,89510,89291,Passy,89,,,89291000ZA0161,,,,,,,,,,,,,0,,,,,S,sols,,,765,3.281843,48.117884
2021-1527716,2021-09-20,000001,Vente,70000,,,LA GRANDE PIECE,B018,89510,89291,Passy,89,,,89291000ZA0162,,,,,,,,,,,,,0,,,,,S,sols,,,467,3.282401,48.118092
2021-1527716,2021-09-20,000001,Vente,70000,,,LA GRANDE PIECE,B018,89510,89291,Passy,89,,,89291000ZA0163,,,,,,,,,,,,,0,,,,,S,sols,,,2610,3.282455,48.11775
2021-1527716,2021-09-20,000001,Vente,70000,,,LA GRANDE PIECE,B018,89510,89291,Passy,89,,,89291000ZA0164,,,,,,,,,,,,,0,,,,,S,sols,,,352,3.282961,48.117899
2021-1527716,2021-09-20,000001,Vente,70000,,,LA GRANDE PIECE,B018,89510,89291,Passy,89,,,89291000ZA0165,,,,,,,,,,,,,0,,,,,S,sols,,,1112,3.282879,48.117773
2021-1527734,2021-09-04,000001,Vente,143000,3,,RUE DE LA CHAPELLE,0045,89510,89291,Passy,89,,,89291000AA0124,,,,,,,,,,,,,0,1,Maison,95,4,S,sols,,,598,3.303939,48.111463
2021-1527781,2021-09-14,000001,Vente,87000,4,,GR GRANDE RUE,0095,89510,89291,Passy,89,,,89291000AA0147,,,,,,,,,,,,,0,1,Maison,93,3,S,sols,,,336,3.304326,48.110996
2021-1527781,2021-09-14,000001,Vente,87000,4,,GR GRANDE RUE,0095,89510,89291,Passy,89,,,89291000AA0147,,,,,,,,,,,,,0,3,Dépendance,,0,S,sols,,,336,3.304326,48.110996
2021-1527781,2021-09-14,000001,Vente,87000,4,,GR GRANDE RUE,0095,89510,89291,Passy,89,,,89291000AA0147,,,,,,,,,,,,,0,3,Dépendance,,0,S,sols,,,336,3.304326,48.110996
