id_mutation,date_mutation,numero_disposition,nature_mutation,valeur_fonciere,adresse_numero,adresse_suffixe,adresse_nom_voie,adresse_code_voie,code_postal,code_commune,nom_commune,code_departement,ancien_code_commune,ancien_nom_commune,id_parcelle,ancien_id_parcelle,numero_volume,lot1_numero,lot1_surface_carrez,lot2_numero,lot2_surface_carrez,lot3_numero,lot3_surface_carrez,lot4_numero,lot4_surface_carrez,lot5_numero,lot5_surface_carrez,nombre_lots,code_type_local,type_local,surface_reelle_bati,nombre_pieces_principales,code_nature_culture,nature_culture,code_nature_culture_speciale,nature_culture_speciale,surface_terrain,longitude,latitude
2021-1517084,2021-01-07,000001,Vente,127000,1,,RUE CHARLES LAUBRY,0300,89600,89345,Saint-Florentin,89,,,89345000BE0075,,,1,270.33,4,,8,,,,,,3,4,Local industriel. commercial ou assimilé,475,0,,,,,,3.722454,48.001297
2021-1517084,2021-01-07,000001,Vente,127000,1,,RUE CHARLES LAUBRY,0300,89600,89345,Saint-Florentin,89,,,89345000BE0075,,,9,,,,,,,,,,1,3,Dépendance,,0,,,,,,3.722454,48.001297
2021-1517084,2021-01-07,000001,Vente,127000,1,,RUE CHARLES LAUBRY,0300,89600,89345,Saint-Florentin,89,,,89345000BE0075,,,7,,,,,,,,,,1,3,Dépendance,,0,,,,,,3.722454,48.001297
2021-1517084,2021-01-07,000001,Vente,127000,1,,RUE CHARLES LAUBRY,0300,89600,89345,Saint-Florentin,89,,,89345000BE0075,,,12,,,,,,,,,,1,3,Dépendance,,0,,,,,,3.722454,48.001297
2021-1517084,2021-01-07,000001,Vente,127000,1,,RUE CHARLES LAUBRY,0300,89600,89345,Saint-Florentin,89,,,89345000BE0075,,,1,270.33,6,,,,,,,,2,3,Dépendance,,0,,,,,,3.722454,48.001297
2021-1517179,2021-01-21,000001,Vente,20200,4,,RUE CLAUDE SIMONNOT,0350,89600,89345,Saint-Florentin,89,,,89345000BD0236,,,2,63.65,,,,,,,,,1,2,Appartement,70,3,,,,,,3.718828,47.998016
2021-1517179,2021-01-21,000001,Vente,20200,4,,RUE CLAUDE SIMONNOT,0350,89600,89345,Saint-Florentin,89,,,89345000BD0236,,,67,,,,,,,,,,1,3,Dépendance,,0,,,,,,3.718828,47.998016
2021-1517195,2021-01-14,000001,Vente,25000,2,,RUE JUST MEISONASSE,1095,89600,89345,Saint-Florentin,89,,,89345000BD0236,,,55,79.67,,,,,,,,,1,2,Appartement,85,4,,,,,,3.718828,47.998016
2021-1517195,2021-01-14,000001,Vente,25000,2,,RUE JUST MEISONASSE,1095,89600,89345,Saint-Florentin,89,,,89345000BD0236,,,120,,,,,,,,,,1,3,Dépendance,,0,,,,,,3.718828,47.998016
2021-1517197,2021-01-21,000001,Vente,83000,21,,RUE CHARLES GOUNOD,0290,89600,89345,Saint-Florentin,89,,,89345000BD0378,,,,,,,,,,,,,0,1,Maison,75,4,S,sols,,,415,3.724269,47.998723
2021-1517197,2021-01-21,000001,Vente,83000,,,LA CROIX GALLARD,B038,89600,89345,Saint-Florentin,89,,,89345000BD0381,,,,,,,,,,,,,0,,,,,J,jardins,,,222,3.724511,47.998718
2021-1517234,2021-02-01,000001,Vente,1500,,,LES HEBEICHES,B091,89600,89345,Saint-Florentin,89,,,89345000BH0096,,,,,,,,,,,,,0,,,,,T,terres,,,105,3.718351,47.993609
2021-1517234,2021-02-01,000001,Vente,1500,,,LES HEBEICHES,B091,89600,89345,Saint-Florentin,89,,,89345000BH0097,,,,,,,,,,,,,0,,,,,T,terres,,,219,3.718409,47.99366
2021-1517234,2021-02-01,000001,Vente,1500,,,LES HEBEICHES,B091,89600,89345,Saint-Florentin,89,,,89345000BH0100,,,,,,,,,,,,,0,,,,,T,terres,,,510,3.71864,47.993846
2021-1517234,2021-02-01,000001,Vente,1500,,,LES SABLES,B150,89600,89345,Saint-Florentin,89,,,89345000BH0131,,,,,,,,,,,,,0,,,,,J,jardins,,,1150,3.718976,47.993298
2021-1517234,2021-02-01,000001,Vente,1500,,,LES SABLES,B150,89600,89345,Saint-Florentin,89,,,89345000BH0132,,,,,,,,,,,,,0,,,,,J,jardins,,,326,3.718976,47.993181
2021-1517276,2021-01-22,000001,Vente terrain à bâtir,50000,,,LES CHAMPAGNES,B024,89600,89345,Saint-Florentin,89,,,89345000AO0411,,,,,,,,,,,,,0,,,,,AB,terrains a bâtir,,,223,3.748579,47.999844
2021-1517276,2021-01-22,000001,Vente terrain à bâtir,50000,,,LES CHAMPAGNES,B024,89600,89345,Saint-Florentin,89,,,89345000AO0445,,,,,,,,,,,,,0,,,,,AB,terrains a bâtir,,,918,3.748215,47.99979
2021-1517276,2021-01-22,000001,Vente terrain à bâtir,50000,,,LA PATURE MARDEE,B117,89600,89345,Saint-Florentin,89,,,89345000AO0469,,,,,,,,,,,,,0,,,,,AB,terrains a bâtir,,,78,3.746559,48.000038
2021-1517276,2021-01-22,000001,Vente terrain à bâtir,50000,,,LES CHAMPAGNES,B024,89600,89345,Saint-Florentin,89,,,89345000AO0472,,,,,,,,,,,,,0,,,,,AB,terrains a bâtir,,,7003,3.746962,47.999827
2021-1517276,2021-01-22,000001,Vente terrain à bâtir,50000,,,RUE JEAN  MOULIN,0847,89600,89345,Saint-Florentin,89,,,89345000AO0475,,,,,,,,,,,,,0,,,,,AB,terrains a bâtir,,,840,3.746573,47.999709
2021-1517330,2021-02-01,000001,Vente,54000,17,,PL DILO,0440,89600,89345,Saint-Florentin,89,,,89345000AS0043,,,,,,,,,,,,,0,4,Local industriel. commercial ou assimilé,251,0,S,sols,,,242,3.729175,48.002936
2021-1517361,2021-01-27,000001,Vente,137000,2,,RUE AUGUSTE RENOIR,0073,89600,89345,Saint-Florentin,89,,,89345000BE0354,,,,,,,,,,,,,0,1,Maison,99,5,S,sols,,,618,3.716908,48.002456
2021-1517385,2021-02-12,000001,Vente,117500,31,,RUE DE LA MALADRERIE,1010,89600,89345,Saint-Florentin,89,,,89345000BD0125,,,,,,,,,,,,,0,1,Maison,94,4,S,sols,,,327,3.723559,47.997048
2021-1517385,2021-02-12,000001,Vente,117500,,,LES SABLES,B150,89600,89345,Saint-Florentin,89,,,89345000BD0129,,,,,,,,,,,,,0,,,,,J,jardins,MARAI,Pré marais,616,3.723666,47.996779
2021-1517386,2021-02-08,000001,Vente,77000,4,,RUE SAINT MARTIN,1510,89600,89345,Saint-Florentin,89,,,89345000AT0030,,,7,,,,,,,,,,1,3,Dépendance,,0,,,,,,3.730182,48.00134
2021-1517386,2021-02-08,000001,Vente,77000,4,,RUE SAINT MARTIN,1510,89600,89345,Saint-Florentin,89,,,89345000AT0030,,,5,,,,,,,,,,1,3,Dépendance,,0,,,,,,3.730182,48.00134
2021-1517386,2021-02-08,000001,Vente,77000,4,,RUE SAINT MARTIN,1510,89600,89345,Saint-Florentin,89,,,89345000AT0030,,,4,74.94,,,,,,,,,1,2,Appartement,76,3,,,,,,3.730182,48.00134
2021-1517535,2021-02-22,000001,Vente,,,,LA CROIX DES FOSSES,B037,89600,89345,Saint-Florentin,89,,,89345000ZD0039,,,,,,,,,,,,,0,,,,,T,terres,,,48900,3.669308,47.997313
2021-1517535,2021-02-22,000001,Vente,,,,LES ROCHES,B148,89600,89345,Saint-Florentin,89,,,89345000ZE0034,,,,,,,,,,,,,0,,,,,BT,taillis simples,,,4000,3.696563,48.012059
2021-1517535,2021-02-22,000001,Vente,,,,LES ROCHES,B148,89600,89345,Saint-Florentin,89,,,89345000ZE0034,,,,,,,,,,,,,0,,,,,T,terres,,,75900,3.696563,48.012059
2021-1517535,2021-02-22,000001,Vente,,,,LES HAUTS,B090,89600,89345,Saint-Florentin,89,,,89345000ZH0212,,,,,,,,,,,,,0,,,,,T,terres,,,26990,3.701123,48.009739
2021-1517535,2021-02-22,000001,Vente,,,,LES AMANDIERS,B002,89600,89345,Saint-Florentin,89,,,89345000ZI0001,,,,,,,,,,,,,0,,,,,T,terres,,,11030,3.698875,48.006346
2021-1517535,2021-02-22,000001,Vente,,,,LES AMANDIERS,B002,89600,89345,Saint-Florentin,89,,,89345000ZI0001,,,,,,,,,,,,,0,,,,,T,terres,,,11030,3.698875,48.006346
2021-1517535,2021-02-22,000001,Vente,,,,CHAMP DES POIS,B021,89600,89345,Saint-Florentin,89,,,89345000ZN0022,,,,,,,,,,,,,0,,,,,T,terres,,,49320,3.688456,47.992238
2021-1517555,2021-03-03,000001,Vente,132000,15,,RUE DU CAMP DE BARCENA,0200,89600,89345,Saint-Florentin,89,,,89345000ZH0170,,,,,,,,,,,,,0,1,Maison,92,4,J,jardins,HORT,Jardin horticole,1000,3.684861,48.006038
2021-1517555,2021-03-03,000001,Vente,132000,15,,RUE DU CAMP DE BARCENA,0200,89600,89345,Saint-Florentin,89,,,89345000ZH0170,,,,,,,,,,,,,0,1,Maison,92,4,S,sols,,,940,3.684861,48.006038
2021-1517562,2021-02-22,000001,Vente,40000,,,AVROLLES,B005,89600,89345,Saint-Florentin,89,,,89345000BN0259,,,,,,,,,,,,,0,,,,,S,sols,,,1139,3.684994,48.002321
2021-1517562,2021-02-22,000001,Vente,40000,,,AVROLLES,B005,89600,89345,Saint-Florentin,89,,,89345000BN0260,,,,,,,,,,,,,0,,,,,S,sols,,,202,3.685031,48.002504
2021-1517562,2021-02-22,000001,Vente,40000,,,AVROLLES,B005,89600,89345,Saint-Florentin,89,,,89345000BN0261,,,,,,,,,,,,,0,,,,,J,jardins,,,693,3.68496,48.00273
2021-1517562,2021-02-22,000001,Vente,40000,,,AVROLLES,B005,89600,89345,Saint-Florentin,89,,,89345000BN0460,,,,,,,,,,,,,0,,,,,S,sols,,,1140,3.684813,48.002084
2021-1517562,2021-02-22,000001,Vente,40000,,,AVROLLES,B005,89600,89345,Saint-Florentin,89,,,89345000BN0460,,,,,,,,,,,,,0,,,,,P,prés,,,8172,3.684813,48.002084
2021-1517581,2021-02-22,000001,Vente,1520,,,LES VOLAILLES,B168,89600,89345,Saint-Florentin,89,,,89345000ZI0096,,,,,,,,,,,,,0,,,,,T,terres,,,1810,3.707663,47.999964
2021-1517581,2021-02-22,000001,Vente,1520,,,LES VOLAILLES,B168,89600,89345,Saint-Florentin,89,,,89345000ZI0099,,,,,,,,,,,,,0,,,,,T,terres,,,1660,3.706912,47.999848
2021-1517581,2021-02-22,000001,Vente,1520,,,LES VOLAILLES,B168,89600,89345,Saint-Florentin,89,,,89345000ZI0100,,,,,,,,,,,,,0,,,,,T,terres,,,970,3.706753,47.999833
2021-1517582,2021-03-10,000001,Vente,32000,4,,RUE DE L ARGONNE,0060,89600,89345,Saint-Florentin,89,,,89345000ZK0096,,,19,62.63,39,,,,,,,,2,2,Appartement,69,3,,,,,,3.717546,47.998883
2021-1517583,2021-03-01,000001,Vente,6480,,,LES GARATS,B057,89600,89345,Saint-Florentin,89,,,89345000ZI0032,,,,,,,,,,,,,0,,,,,T,terres,,,5290,3.708336,48.007186
2021-1517583,2021-03-01,000001,Vente,6480,,,LES GARATS,B057,89600,89345,Saint-Florentin,89,,,89345000ZI0033,,,,,,,,,,,,,0,,,,,T,terres,,,3090,3.707387,48.006169
2021-1517583,2021-03-01,000001,Vente,6480,,,LES GARATS,B057,89600,89345,Saint-Florentin,89,,,89345000ZI0034,,,,,,,,,,,,,0,,,,,T,terres,,,4970,3.707518,48.00584
2021-1517583,2021-03-01,000001,Vente,6480,,,LES GARATS,B057,89600,89345,Saint-Florentin,89,,,89345000ZI0035,,,,,,,,,,,,,0,,,,,T,terres,,,1350,3.708039,48.006179
2021-1517583,2021-03-01,000001,Vente,6480,,,LES GARATS,B057,89600,89345,Saint-Florentin,89,,,89345000ZI0038,,,,,,,,,,,,,0,,,,,VI,vignes,,,1800,3.708784,48.005629
2021-1517583,2021-03-01,000001,Vente,6480,,,LES GARATS,B057,89600,89345,Saint-Florentin,89,,,89345000ZI0039,,,,,,,,,,,,,0,,,,,VI,vignes,,,730,3.709005,48.006231
2021-1517583,2021-03-01,000001,Vente,6480,,,LES GARATS,B057,89600,89345,Saint-Florentin,89,,,89345000ZI0040,,,,,,,,,,,,,0,,,,,T,terres,,,1180,3.709057,48.005771
2021-1517583,2021-03-01,000001,Vente,6480,,,LES GARATS,B057,89600,89345,Saint-Florentin,89,,,89345000ZI0071,,,,,,,,,,,,,0,,,,,T,terres,,,1400,3.711415,48.006415
2021-1517585,2021-03-15,000001,Vente,26000,4,,RUE DE L ARGONNE,0060,89600,89345,Saint-Florentin,89,,,89345000ZK0096,,,23,63.43,40,,,,,,,,2,2,Appartement,69,3,,,,,,3.717546,47.998883
2021-1517643,2021-03-03,000001,Vente,80000,25,,RUE AUGUSTE RENOIR,0073,89600,89345,Saint-Florentin,89,,,89345000AB0250,,,,,,,,,,,,,0,1,Maison,83,5,S,sols,,,540,3.714791,48.004717
2021-1517652,2021-03-09,000001,Vente,7444,,,LES PETITS ORMEAUX,B123,89600,89345,Saint-Florentin,89,,,89345000ZB0020,,,,,,,,,,,,,0,,,,,T,terres,,,6710,3.651746,48.009794
2021-1517652,2021-03-09,000001,Vente,7444,,,LES PETITS ORMEAUX,B123,89600,89345,Saint-Florentin,89,,,89345000ZB0021,,,,,,,,,,,,,0,,,,,T,terres,,,11900,3.650952,48.009726
2021-1517686,2021-03-24,000001,Vente,836.4,,,SUR LES PREVENCHERES,B118,89600,89345,Saint-Florentin,89,,,89345000AB0119,,,,,,,,,,,,,0,,,,,T,terres,,,1192,3.722799,48.008422
2021-1517686,2021-03-24,000001,Vente,836.4,,,SUR LES PREVENCHERES,B118,89600,89345,Saint-Florentin,89,,,89345000AB0121,,,,,,,,,,,,,0,,,,,T,terres,,,576,3.72306,48.008292
2021-1517686,2021-03-24,000001,Vente,836.4,,,SUR LES PREVENCHERES,B118,89600,89345,Saint-Florentin,89,,,89345000AB0123,,,,,,,,,,,,,0,,,,,T,terres,,,1020,3.722748,48.008261
2021-1517686,2021-03-24,000001,Vente,836.4,,,LES BONNOTTES,B012,89600,89345,Saint-Florentin,89,,,89345000AE0036,,,,,,,,,,,,,0,,,,,P,prés,,,1161,3.736502,48.011007
2021-1517723,2021-03-26,000001,Vente,6000,,,LE CHATEAU,B029,89600,89345,Saint-Florentin,89,,,89345000ZE0004,,,,,,,,,,,,,0,,,,,P,prés,,,12525,3.68174,48.006713
2021-1517723,2021-03-26,000001,Vente,6000,,,LE CHATEAU,B029,89600,89345,Saint-Florentin,89,,,89345000ZE0005,,,,,,,,,,,,,0,,,,,BT,taillis simples,,,46955,3.679833,48.00666
2021-1517723,2021-03-26,000001,Vente,6000,,,LE CHATEAU,B029,89600,89345,Saint-Florentin,89,,,89345000ZE0006,,,,,,,,,,,,,0,,,,,VE,vergers,,,2570,3.682732,48.006317
2021-1517731,2021-03-18,000001,Vente,20000,,,LA SAUNIERE,B152,89600,89345,Saint-Florentin,89,,,89345000AZ0150,,,,,,,,,,,,,0,,,,,S,sols,,,5,3.732888,47.98401
2021-1517731,2021-03-18,000001,Vente,20000,,,LA SAUNIERE,B152,89600,89345,Saint-Florentin,89,,,89345000AZ0224,,,,,,,,,,,,,0,,,,,S,sols,,,400,3.734961,47.982991
2021-1517731,2021-03-18,000001,Vente,20000,,,LA SAUNIERE,B152,89600,89345,Saint-Florentin,89,,,89345000AZ0229,,,,,,,,,,,,,0,,,,,S,sols,,,230,3.735631,47.982289
2021-1517731,2021-03-18,000001,Vente,20000,,,LA SAUNIERE,B152,89600,89345,Saint-Florentin,89,,,89345000AZ0239,,,,,,,,,,,,,0,,,,,S,sols,,,909,3.735933,47.98277
2021-1517755,2021-03-12,000001,Vente,12000,5,,RUE DESCOURTIVES,0420,89600,89345,Saint-Florentin,89,,,89345000AS0062,,,,,,,,,,,,,0,3,Dépendance,,0,S,sols,,,283,3.731285,48.003441
2021-1517756,2021-03-29,000001,Vente,24000,4,,RUE DE L ARGONNE,0060,89600,89345,Saint-Florentin,89,,,89345000ZK0096,,,24,78.77,38,,,,,,,,2,2,Appartement,85,4,,,,,,3.717546,47.998883
2021-1517759,2021-03-30,000001,Vente,6200,,,LA NOUE BILLONNEE,B112,89600,89345,Saint-Florentin,89,,,89345000ZC0156,,,,,,,,,,,,,0,,,,,P,prés,,,8640,3.670525,48.003037
2021-1517759,2021-03-30,000001,Vente,6200,,,LA NOUE BILLONNEE,B112,89600,89345,Saint-Florentin,89,,,89345000ZC0157,,,,,,,,,,,,,0,,,,,P,prés,,,17160,3.671343,48.003016
2021-1517835,2021-03-16,000001,Vente,281957,14,,GR GRANDE RUE,0720,89600,89345,Saint-Florentin,89,,,89345000AT0337,,,,,,,,,,,,,0,2,Appartement,54,2,S,sols,,,292,3.728901,48.001148
2021-1517835,2021-03-16,000001,Vente,281957,14,,GR GRANDE RUE,0720,89600,89345,Saint-Florentin,89,,,89345000AT0337,,,,,,,,,,,,,0,4,Local industriel. commercial ou assimilé,73,0,S,sols,,,292,3.728901,48.001148
2021-1517835,2021-03-16,000001,Vente,281957,14,,GR GRANDE RUE,0720,89600,89345,Saint-Florentin,89,,,89345000AT0337,,,,,,,,,,,,,0,2,Appartement,56,2,S,sols,,,292,3.728901,48.001148
2021-1517835,2021-03-16,000001,Vente,281957,14,,GR GRANDE RUE,0720,89600,89345,Saint-Florentin,89,,,89345000AT0337,,,,,,,,,,,,,0,2,Appartement,64,3,S,sols,,,292,3.728901,48.001148
2021-1517835,2021-03-16,000001,Vente,281957,14,,GR GRANDE RUE,0720,89600,89345,Saint-Florentin,89,,,89345000AT0337,,,,,,,,,,,,,0,1,Maison,84,4,S,sols,,,292,3.728901,48.001148
2021-1517835,2021-03-16,000001,Vente,281957,7,,RUE DU COURQUILLON,0400,89600,89345,Saint-Florentin,89,,,89345000AT0402,,,,,,,,,,,,,0,,,,,AB,terrains a bâtir,,,124,3.728792,48.001339
2021-1517835,2021-03-16,000001,Vente,281957,,,RUE GASTON GALLIMARD,0605,89600,89345,Saint-Florentin,89,,,89345000AT0409,,,,,,,,,,,,,0,,,,,S,sols,,,34,3.728694,48.001192
2021-1517835,2021-03-16,000001,Vente,281957,,,RUE GASTON GALLIMARD,0605,89600,89345,Saint-Florentin,89,,,89345000AT0410,,,,,,,,,,,,,0,,,,,S,sols,,,1,3.728808,48.001245
2021-1517891,2021-04-09,000001,Vente,6000,,,LA SAUNIERE,B152,89600,89345,Saint-Florentin,89,,,89345000AZ0150,,,,,,,,,,,,,0,,,,,S,sols,,,5,3.732888,47.98401
2021-1517891,2021-04-09,000001,Vente,6000,,,LA SAUNIERE,B152,89600,89345,Saint-Florentin,89,,,89345000AZ0224,,,,,,,,,,,,,0,,,,,S,sols,,,400,3.734961,47.982991
2021-1517891,2021-04-09,000001,Vente,6000,,,LA SAUNIERE,B152,89600,89345,Saint-Florentin,89,,,89345000AZ0229,,,,,,,,,,,,,0,,,,,S,sols,,,230,3.735631,47.982289
2021-1517891,2021-04-09,000001,Vente,6000,,,LA SAUNIERE,B152,89600,89345,Saint-Florentin,89,,,89345000AZ0239,,,,,,,,,,,,,0,,,,,S,sols,,,909,3.735933,47.98277
2021-1517906,2021-04-26,000001,Vente,110000,12,,RUE ANTOINE DE ST EXUPERY,0050,89600,89345,Saint-Florentin,89,,,89345000AR0069,,,,,,,,,,,,,0,1,Maison,56,3,S,sols,,,596,3.735876,48.005945
2021-1517906,2021-04-26,000001,Vente,110000,,,L ARMELIE,B003,89600,89345,Saint-Florentin,89,,,89345000AR0081,,,,,,,,,,,,,0,,,,,S,sols,,,375,3.736814,48.005589
2021-1517906,2021-04-26,000001,Vente,110000,,,L ARMELIE,B003,89600,89345,Saint-Florentin,89,,,89345000AR0087,,,,,,,,,,,,,0,,,,,S,sols,,,4813,3.735751,48.005405
2021-1517912,2021-04-22,000001,Vente,80520,,,CHAMP MEGRET,B022,89600,89345,Saint-Florentin,89,,,89345000ZK0031,,,,,,,,,,,,,0,,,,,T,terres,,,176500,3.702225,47.994074
2021-1517914,2021-04-22,000002,Vente,114127,,,LES VOLAILLES,B168,89600,89345,Saint-Florentin,89,,,89345000ZI0092,,,,,,,,,,,,,0,,,,,T,terres,,,980,3.708629,48.000442
2021-1517914,2021-04-22,000002,Vente,114127,,,LES VOLAILLES,B168,89600,89345,Saint-Florentin,89,,,89345000ZI0092,,,,,,,,,,,,,0,,,,,T,terres,,,2580,3.708629,48.000442
2021-1517914,2021-04-22,000002,Vente,114127,,,LES VOLAILLES,B168,89600,89345,Saint-Florentin,89,,,89345000ZI0092,,,,,,,,,,,,,0,,,,,BT,taillis simples,,,1080,3.708629,48.000442
2021-1517914,2021-04-22,000002,Vente,114127,,,LES VOLAILLES,B168,89600,89345,Saint-Florentin,89,,,89345000ZI0093,,,,,,,,,,,,,0,,,,,BT,taillis simples,,,1310,3.708456,48.000375
2021-1517914,2021-04-22,000002,Vente,114127,,,LES VOLAILLES,B168,89600,89345,Saint-Florentin,89,,,89345000ZI0093,,,,,,,,,,,,,0,,,,,T,terres,,,1710,3.708456,48.000375
2021-1517914,2021-04-22,000002,Vente,114127,,,LES GARATS,B057,89600,89345,Saint-Florentin,89,,,89345000ZI0227,,,,,,,,,,,,,0,,,,,T,terres,,,2400,3.71094,48.005279
2021-1517914,2021-04-22,000002,Vente,114127,,,FER A CHEVAL,B048,89600,89345,Saint-Florentin,89,,,89345000ZK0026,,,,,,,,,,,,,0,,,,,T,terres,,,6960,3.712603,47.995453
2021-1517914,2021-04-22,000002,Vente,114127,,,FER A CHEVAL,B048,89600,89345,Saint-Florentin,89,,,89345000ZK0026,,,,,,,,,,,,,0,,,,,T,terres,,,6960,3.712603,47.995453
2021-1517914,2021-04-22,000002,Vente,114127,,,FER A CHEVAL,B048,89600,89345,Saint-Florentin,89,,,89345000ZK0026,,,,,,,,,,,,,0,,,,,BT,taillis simples,,,3070,3.712603,47.995453
2021-1517914,2021-04-22,000002,Vente,114127,,,FER A CHEVAL,B048,89600,89345,Saint-Florentin,89,,,89345000ZK0030,,,,,,,,,,,,,0,,,,,T,terres,,,48300,3.708566,47.993923
2021-1517914,2021-04-22,000002,Vente,114127,,,LE PETIT PRE,B121,89600,89345,Saint-Florentin,89,,,89345000ZK0032,,,,,,,,,,,,,0,,,,,T,terres,,,6600,3.69943,47.993928
2021-1517914,2021-04-22,000002,Vente,114127,,,PETIT FREVAUX,B120,89600,89345,Saint-Florentin,89,,,89345000ZK0074,,,,,,,,,,,,,0,,,,,T,terres,,,10166,3.697748,47.99366
2021-1517914,2021-04-22,000002,Vente,114127,,,PETIT FREVAUX,B120,89600,89345,Saint-Florentin,89,,,89345000ZK0074,,,,,,,,,,,,,0,,,,,T,terres,,,10166,3.697748,47.99366
2021-1517914,2021-04-22,000002,Vente,114127,,,PETIT FREVAUX,B120,89600,89345,Saint-Florentin,89,,,89345000ZK0095,,,,,,,,,,,,,0,,,,,T,terres,,,16639,3.698108,47.992651
2021-1517914,2021-04-22,000002,Vente,114127,,,PETIT FREVAUX,B120,89600,89345,Saint-Florentin,89,,,89345000ZK0095,,,,,,,,,,,,,0,,,,,T,terres,,,16638,3.698108,47.992651
2021-1517915,2021-04-22,000001,Vente,43620,,,LES MONTS BOUSSARDS,B105,89600,89345,Saint-Florentin,89,,,89345000ZL0013,,,,,,,,,,,,,0,,,,,T,terres,,,101500,3.70828,47.991211
2021-1517915,2021-04-22,000001,Vente,43620,,,LES MONTS BOUSSARDS,B105,89600,89345,Saint-Florentin,89,,,89345000ZL0013,,,,,,,,,,,,,0,,,,,BT,taillis simples,,,2500,3.70828,47.991211
2021-1517916,2021-04-22,000001,Vente,86412,,,LES VOLAILLES,B168,89600,89345,Saint-Florentin,89,,,89345000ZK0008,,,,,,,,,,,,,0,,,,,VE,vergers,,,4330,3.712506,47.997724
2021-1517984,2021-04-22,000001,Vente,17000,8,,IMP SAINT ROCH,1540,89600,89345,Saint-Florentin,89,,,89345000AV0142,,,,,,,,,,,,,0,1,Maison,63,3,S,sols,,,192,3.72944,47.998762
2021-1518021,2021-04-15,000001,Vente,155000,,,AVROLLES,B005,89600,89345,Saint-Florentin,89,,,89345000BN0017,,,,,,,,,,,,,0,,,,,S,sols,,,413,3.681854,48.004563
2021-1518021,2021-04-15,000001,Vente,155000,6,,RUE DES MARRONIERS,1065,89600,89345,Saint-Florentin,89,,,89345000BN0018,,,,,,,,,,,,,0,3,Dépendance,,0,S,sols,,,985,3.681866,48.00468
2021-1518021,2021-04-15,000001,Vente,155000,6,,RUE DES MARRONIERS,1065,89600,89345,Saint-Florentin,89,,,89345000BN0018,,,,,,,,,,,,,0,1,Maison,75,4,S,sols,,,985,3.681866,48.00468
2021-1518021,2021-04-15,000001,Vente,155000,,,AVROLLES,B005,89600,89345,Saint-Florentin,89,,,89345000BN0019,,,,,,,,,,,,,0,,,,,J,jardins,,,3305,3.681908,48.005006
2021-1518035,2021-04-29,000001,Vente,125500,10,,RUE JEAN RACINE,0850,89600,89345,Saint-Florentin,89,,,89345000BD0331,,,,,,,,,,,,,0,1,Maison,115,6,S,sols,,,714,3.719975,47.997619
2021-1518036,2021-04-29,000001,Vente,4985,,,LE CHAMP VATRIN,B023,89600,89345,Saint-Florentin,89,,,89345000AN0100,,,,,,,,,,,,,0,,,,,P,prés,,,2355,3.765332,48.006427
2021-1518037,2021-04-28,000001,Vente,60000,56,,GR GRANDE RUE,0720,89600,89345,Saint-Florentin,89,,,89345000AV0249,,,50,,,,,,,,,,1,3,Dépendance,,0,,,,,,3.727303,47.999487
2021-1518037,2021-04-28,000001,Vente,60000,56,,GR GRANDE RUE,0720,89600,89345,Saint-Florentin,89,,,89345000AV0249,,,14,73.5,2,,,,,,,,2,3,Dépendance,,0,,,,,,3.727303,47.999487
2021-1518037,2021-04-28,000001,Vente,60000,56,,GR GRANDE RUE,0720,89600,89345,Saint-Florentin,89,,,89345000AV0249,,,14,73.5,2,,,,,,,,2,2,Appartement,74,4,,,,,,3.727303,47.999487
2021-1518040,2021-04-30,000001,Vente,75000,13,,RUE DE LA MALADRERIE,1010,89600,89345,Saint-Florentin,89,,,89345000AW0025,,,,,,,,,,,,,0,1,Maison,80,3,S,sols,,,975,3.725652,47.998209
2021-1518040,2021-04-30,000001,Vente,75000,13,,RUE DE LA MALADRERIE,1010,89600,89345,Saint-Florentin,89,,,89345000AW0025,,,,,,,,,,,,,0,3,Dépendance,,0,S,sols,,,975,3.725652,47.998209
2021-1518040,2021-04-30,000001,Vente,75000,13,,RUE DE LA MALADRERIE,1010,89600,89345,Saint-Florentin,89,,,89345000AW0025,,,,,,,,,,,,,0,3,Dépendance,,0,S,sols,,,975,3.725652,47.998209
2021-1518040,2021-04-30,000001,Vente,75000,13,,RUE DE LA MALADRERIE,1010,89600,89345,Saint-Florentin,89,,,89345000AW0025,,,,,,,,,,,,,0,3,Dépendance,,0,S,sols,,,975,3.725652,47.998209
2021-1518040,2021-04-30,000001,Vente,75000,13,,RUE DE LA MALADRERIE,1010,89600,89345,Saint-Florentin,89,,,89345000AW0025,,,,,,,,,,,,,0,3,Dépendance,,0,S,sols,,,975,3.725652,47.998209
2021-1518040,2021-04-30,000001,Vente,75000,,,LES CHANTELOUPS,B028,89600,89345,Saint-Florentin,89,,,89345000AW0068,,,,,,,,,,,,,0,,,,,J,jardins,,,385,3.725564,47.997436
2021-1518041,2021-04-29,000001,Vente,672,,,CHE DE SAUNIERE,1440,89600,89345,Saint-Florentin,89,,,89345000AZ0289,,,,,,,,,,,,,0,,,,,S,sols,,,672,3.738176,47.983675
2021-1518075,2021-04-12,000001,Vente,70000,1,,RUE PIERRE COUDRY,1210,89600,89345,Saint-Florentin,89,,,89345000BE0091,,,17,,,,,,,,,,1,2,Appartement,74,4,S,sols,,,6,3.724543,48.001625
2021-1518075,2021-04-12,000001,Vente,70000,1,,RUE PIERRE COUDRY,1210,89600,89345,Saint-Florentin,89,,,89345000BE0091,,,1,,14,,15,,6,,,,4,2,Appartement,74,4,,,,,,3.724543,48.001625
2021-1518075,2021-04-12,000001,Vente,70000,1,,RUE PIERRE COUDRY,1210,89600,89345,Saint-Florentin,89,,,89345000BE0091,,,10,,11,,2,,3,,9,,5,2,Appartement,2,0,,,,,,3.724543,48.001625
2021-1518075,2021-04-12,000001,Vente,70000,1,,RUE PIERRE COUDRY,1210,89600,89345,Saint-Florentin,89,,,89345000BE0091,,,5,,,,,,,,,,1,2,Appartement,13,1,,,,,,3.724543,48.001625
2021-1518075,2021-04-12,000001,Vente,70000,1,,RUE PIERRE COUDRY,1210,89600,89345,Saint-Florentin,89,,,89345000BE0091,,,13,,,,,,,,,,1,3,Dépendance,,0,,,,,,3.724543,48.001625
2021-1518075,2021-04-12,000001,Vente,70000,1,,RUE PIERRE COUDRY,1210,89600,89345,Saint-Florentin,89,,,89345000BE0091,,,18,,,,,,,,,,1,2,Appartement,2,0,S,sols,,,3,3.724543,48.001625
2021-1518075,2021-04-12,000001,Vente,70000,1,,RUE PIERRE COUDRY,1210,89600,89345,Saint-Florentin,89,,,89345000BE0091,,,16,,,,,,,,,,1,2,Appartement,2,0,S,sols,,,3,3.724543,48.001625
2021-1518075,2021-04-12,000001,Vente,70000,1,,RUE PIERRE COUDRY,1210,89600,89345,Saint-Florentin,89,,,89345000BE0091,,,19,,,,,,,,,,1,2,Appartement,74,4,S,sols,,,34,3.724543,48.001625
2021-1518109,2021-04-16,000001,Vente,40000,11,,RUE DE LA HALLE,0765,89600,89345,Saint-Florentin,89,,,89345000AT0014,,,,,,,,,,,,,0,1,Maison,193,8,S,sols,,,357,3.730086,48.001659
2021-1518109,2021-04-16,000001,Vente,40000,,,LA VILLE NORD,B166,89600,89345,Saint-Florentin,89,,,89345000AT0017,,,,,,,,,,,,,0,,,,,S,sols,,,52,3.730168,48.001554
2021-1518109,2021-04-16,000001,Vente,40000,3,,PL LOUIS PHELYPEAUX,0955,89600,89345,Saint-Florentin,89,,,89345000AT0358,,,3,,,,,,,,,,1,3,Dépendance,,0,,,,,,3.729981,48.001589
2021-1518109,2021-04-16,000001,Vente,40000,3,,PL LOUIS PHELYPEAUX,0955,89600,89345,Saint-Florentin,89,,,89345000AT0358,,,3,,,,,,,,,,1,2,Appartement,64,2,,,,,,3.729981,48.001589