id_mutation,date_mutation,numero_disposition,nature_mutation,valeur_fonciere,adresse_numero,adresse_suffixe,adresse_nom_voie,adresse_code_voie,code_postal,code_commune,nom_commune,code_departement,ancien_code_commune,ancien_nom_commune,id_parcelle,ancien_id_parcelle,numero_volume,lot1_numero,lot1_surface_carrez,lot2_numero,lot2_surface_carrez,lot3_numero,lot3_surface_carrez,lot4_numero,lot4_surface_carrez,lot5_numero,lot5_surface_carrez,nombre_lots,code_type_local,type_local,surface_reelle_bati,nombre_pieces_principales,code_nature_culture,nature_culture,code_nature_culture_speciale,nature_culture_speciale,surface_terrain,longitude,latitude
2021-1517415,2021-02-16,000001,Vente,3150,,,LES VAUX DU COIN,B056,89700,89445,Vézannes,89,,,894450000C0403,,,,,,,,,,,,,0,,,,,BR,futaies résineuses,PIN,Pins,1210,3.907927,47.884465
2021-1517415,2021-02-16,000001,Vente,3150,,,LES VAUX DU COIN,B056,89700,89445,Vézannes,89,,,894450000C0404,,,,,,,,,,,,,0,,,,,BT,taillis simples,,,2315,3.90687,47.883547
2021-1517415,2021-02-16,000001,Vente,3150,,,LES VAUX DU COIN,B056,89700,89445,Vézannes,89,,,894450000C0441,,,,,,,,,,,,,0,,,,,BT,taillis simples,,,1870,3.906409,47.881118
2021-1517415,2021-02-16,000001,Vente,3150,,,LES VAUX DU COIN,B056,89700,89445,Vézannes,89,,,894450000C0449,,,,,,,,,,,,,0,,,,,BT,taillis simples,,,1555,3.906446,47.881609
2021-1517415,2021-02-16,000001,Vente,3150,,,LES VAUX DU COIN,B056,89700,89445,Vézannes,89,,,894450000C0452,,,,,,,,,,,,,0,,,,,BT,taillis simples,,,340,3.904999,47.88139
2021-1517415,2021-02-16,000001,Vente,3150,,,LES VAUX DU COIN,B056,89700,89445,Vézannes,89,,,894450000C0454,,,,,,,,,,,,,0,,,,,BT,taillis simples,,,680,3.906764,47.881796
2021-1517415,2021-02-16,000001,Vente,3150,,,LES VAUX DU COIN,B056,89700,89445,Vézannes,89,,,894450000C0455,,,,,,,,,,,,,0,,,,,BT,taillis simples,,,340,3.907857,47.882029
2021-1518447,2021-06-15,000001,Vente,10963,,,LA LAMME,B034,89700,89445,Vézannes,89,,,89445000ZM0026,,,,,,,,,,,,,0,,,,,T,terres,,,8660,3.894334,47.874956
2021-1518447,2021-06-15,000001,Vente,10963,,,LA LAMME,B034,89700,89445,Vézannes,89,,,89445000ZM0026,,,,,,,,,,,,,0,,,,,T,terres,,,1090,3.894334,47.874956
2021-1518447,2021-06-15,000001,Vente,10963,,,VALLEE DE VAUT GAILLARD,B053,89700,89445,Vézannes,89,,,89445000ZO0005,,,,,,,,,,,,,0,,,,,T,terres,,,12255,3.865727,47.868561
2021-1518447,2021-06-15,000001,Vente,10963,,,VALLEE DE VAUT GAILLARD,B053,89700,89445,Vézannes,89,,,89445000ZO0005,,,,,,,,,,,,,0,,,,,T,terres,,,12255,3.865727,47.868561
2021-1519577,2021-09-17,000001,Vente,91000,,,LE VILLAGE,B060,89700,89445,Vézannes,89,,,894450000A0423,,,,,,,,,,,,,0,,,,,S,sols,,,29,3.87581,47.876903
2021-1519577,2021-09-17,000001,Vente,91000,7,,RTE DE VEZINNES,0250,89700,89445,Vézannes,89,,,894450000A0428,,1,,,,,,,,,,,0,,,,,,,,,,3.875856,47.876803
2021-1519577,2021-09-17,000001,Vente,91000,7,X,RTE DE VEZINNES,0250,89700,89445,Vézannes,89,,,894450000A0429,,,,,,,,,,,,,0,3,Dépendance,,0,S,sols,,,329,3.87579,47.87675
2021-1519577,2021-09-17,000001,Vente,91000,7,X,RTE DE VEZINNES,0250,89700,89445,Vézannes,89,,,894450000A0429,,,,,,,,,,,,,0,1,Maison,95,3,S,sols,,,329,3.87579,47.87675
2021-1519577,2021-09-17,000001,Vente,91000,,,LES LONGUES RAYES,B035,89700,89445,Vézannes,89,,,89445000ZL0083,,,,,,,,,,,,,0,,,,,J,jardins,,,1420,3.876311,47.877024
