id_mutation,date_mutation,numero_disposition,nature_mutation,valeur_fonciere,adresse_numero,adresse_suffixe,adresse_nom_voie,adresse_code_voie,code_postal,code_commune,nom_commune,code_departement,ancien_code_commune,ancien_nom_commune,id_parcelle,ancien_id_parcelle,numero_volume,lot1_numero,lot1_surface_carrez,lot2_numero,lot2_surface_carrez,lot3_numero,lot3_surface_carrez,lot4_numero,lot4_surface_carrez,lot5_numero,lot5_surface_carrez,nombre_lots,code_type_local,type_local,surface_reelle_bati,nombre_pieces_principales,code_nature_culture,nature_culture,code_nature_culture_speciale,nature_culture_speciale,surface_terrain,longitude,latitude
2021-1639157,2021-01-15,000001,Vente terrain à bâtir,121000,9011,,BD GAMBETTA,0380,95640,95370,Marines,95,,,95370000ZC0084,,,,,,,,,,,,,0,1,Maison,160,1,AB,terrains a bâtir,,,317,1.97155,49.150577
2021-1639157,2021-01-15,000001,Vente terrain à bâtir,121000,9011,,BD GAMBETTA,0380,95640,95370,Marines,95,,,95370000ZC0084,,,,,,,,,,,,,0,3,Dépendance,,0,AB,terrains a bâtir,,,317,1.97155,49.150577
2021-1639197,2021-01-21,000001,Vente,386000,19,,RUE NICOLAS BRULART DE SILLERY,0783,95640,95370,Marines,95,,,95370000ZD0203,,,,,,,,,,,,,0,1,Maison,130,5,S,sols,,,711,1.975336,49.142017
2021-1639212,2021-01-08,000001,Vente,310500,1,T,RUE DES HAUTIERS,0460,95640,95370,Marines,95,,,95370000AC0041,,,,,,,,,,,,,0,1,Maison,89,5,S,sols,,,480,1.983872,49.146744
2021-1639238,2021-01-26,000001,Vente,228000,8,,BD GAMBETTA,0380,95640,95370,Marines,95,,,95370000AC0001,,,,,,,,,,,,,0,2,Appartement,35,2,S,sols,,,207,1.977144,49.146062
2021-1639238,2021-01-26,000001,Vente,228000,8,,BD GAMBETTA,0380,95640,95370,Marines,95,,,95370000AC0001,,,,,,,,,,,,,0,3,Dépendance,,0,S,sols,,,207,1.977144,49.146062
2021-1639238,2021-01-26,000001,Vente,228000,8,,BD GAMBETTA,0380,95640,95370,Marines,95,,,95370000AC0001,,,,,,,,,,,,,0,2,Appartement,40,3,S,sols,,,207,1.977144,49.146062
2021-1639297,2021-01-06,000001,Vente,320000,5,,RUE CLAUDE MANTEL,0169,95640,95370,Marines,95,,,95370000AE0175,,,,,,,,,,,,,0,1,Maison,100,5,S,sols,,,417,1.987467,49.142845
2021-1639411,2021-01-13,000001,Vente,2000,,,RUE JEAN JAURES,0560,95640,95370,Marines,95,,,95370000AD0243,,,,,,,,,,,,,0,,,,,S,sols,,,125,1.981708,49.143442
2021-1639411,2021-01-13,000001,Vente,2000,,,RUE JEAN JAURES,0560,95640,95370,Marines,95,,,95370000AD0244,,,,,,,,,,,,,0,,,,,S,sols,,,168,1.981879,49.143251
2021-1639411,2021-01-13,000001,Vente,2000,,,RUE JEAN JAURES,0560,95640,95370,Marines,95,,,95370000AD0506,,,,,,,,,,,,,0,,,,,S,sols,,,63,1.981588,49.143538
2021-1639431,2021-01-27,000001,Vente,143800,3,,RUE JEAN BAPTISTE CARTRY,0540,95640,95370,Marines,95,,,95370000AC0014,,,,,,,,,,,,,0,1,Maison,56,2,S,sols,,,236,1.978865,49.146014
2021-1639444,2021-01-08,000001,Vente,290000,14,,RUE DU MOULIN A VENT,0740,95640,95370,Marines,95,,,95370000AE0042,,,,,,,,,,,,,0,1,Maison,76,4,S,sols,,,662,1.985191,49.142668
2021-1639480,2021-02-03,000001,Vente,427000,27,,RUE DE NEUILLY,0780,95640,95370,Marines,95,,,95370000AB0233,,,,,,,,,,,,,0,1,Maison,142,5,S,sols,,,537,1.980177,49.14964
2021-1639531,2021-01-19,000001,Vente,150000,3,,RUE DU HEAULME,0480,95640,95370,Marines,95,,,95370000AC0063,,,,,,,,,,,,,0,1,Maison,43,3,S,sols,,,25,1.984823,49.145809
2021-1639606,2021-02-08,000001,Vente terrain à bâtir,150000,,,LA METAIRIE,B037,95640,95370,Marines,95,,,95370000ZC0091,,,,,,,,,,,,,0,,,,,AB,terrains a bâtir,,,1058,1.970287,49.150671
2021-1639674,2021-02-11,000001,Vente,337710,9,,RUE DU BUISSON SAINT REMY,0080,95640,95370,Marines,95,,,95370000AE0106,,,,,,,,,,,,,0,1,Maison,115,6,S,sols,,,1082,1.986654,49.144223
2021-1639693,2021-01-19,000001,Vente,296700,40,,RUE DE LA CROIX DES VIGNES,0200,95640,95370,Marines,95,,,95370000AB0070,,,,,,,,,,,,,0,1,Maison,84,5,S,sols,,,688,1.977374,49.147252
2021-1639695,2021-02-11,000001,Vente,190000,6,,RUE DU MARECHAL FOCH,0680,95640,95370,Marines,95,,,95370000AI0063,,,,,,,,,,,,,0,1,Maison,48,3,S,sols,,,285,1.989413,49.14956
2021-1639701,2021-02-10,000001,Vente,235000,26,,RUE DU GOULET,0420,95640,95370,Marines,95,,,95370000AA0125,,,,,,,,,,,,,0,4,Local industriel. commercial ou assimilé,241,0,S,sols,,,430,1.975205,49.145575
2021-1639810,2021-02-23,000001,Vente terrain à bâtir,123000,,,LA METAIRIE,B037,95640,95370,Marines,95,,,95370000ZC0086,,,,,,,,,,,,,0,,,,,AB,terrains a bâtir,,,123,1.971315,49.150502
2021-1639810,2021-02-23,000001,Vente terrain à bâtir,123000,,,LA METAIRIE,B037,95640,95370,Marines,95,,,95370000ZC0113,,,,,,,,,,,,,0,,,,,AB,terrains a bâtir,,,89,1.971364,49.150408
2021-1639826,2021-02-16,000001,Vente,223404,7,,RUE JEAN BAPTISTE CARTRY,0540,95640,95370,Marines,95,,,95370000AC0016,,,,,,,,,,,,,0,1,Maison,92,4,S,sols,,,121,1.979027,49.146064
2021-1639833,2021-02-05,000001,Vente,355000,7,,RUE CLAUDE MANTEL,0169,95640,95370,Marines,95,,,95370000AE0176,,,,,,,,,,,,,0,1,Maison,109,5,S,sols,,,414,1.987602,49.142922
2021-1639840,2021-02-16,000001,Vente,170900,58,B,RUE JEAN JAURES,0560,95640,95370,Marines,95,,,95370000AC0185,,,,,,,,,,,,,0,1,Maison,73,4,S,sols,,,71,1.983342,49.144613
2021-1639856,2021-02-12,000001,Vente,375000,9001,,RUE DU DOCTEUR MEYNARD,0300,95640,95370,Marines,95,,,95370000AD0301,,,,,,,,,,,,,0,1,Maison,100,5,S,sols,,,463,1.979711,49.145416
2021-1640047,2021-03-04,000001,Vente,95000,9,,RUE DE LA METAIRIE,0710,95640,95370,Marines,95,,,95370000ZD0053,,,19,,9,120.7,,,,,,,2,4,Local industriel. commercial ou assimilé,120,0,,,,,,1.968686,49.147013
2021-1640108,2021-03-11,000001,Vente,355000,7,,ALL DES GRES,0445,95640,95370,Marines,95,,,95370000AE0086,,,,,,,,,,,,,0,1,Maison,89,4,S,sols,,,346,1.987144,49.141515
2021-1640109,2021-03-11,000001,Vente,330000,11,,AV DES MURGERS,0821,95640,95370,Marines,95,,,95370000AB0060,,,,,,,,,,,,,0,1,Maison,96,5,S,sols,,,510,1.978299,49.146517
2021-1640145,2021-02-19,000002,Vente,70000,3,,RUE DU GOULET,0420,95640,95370,Marines,95,,,95370000AD0513,,,,,,,,,,,,,0,,,,,S,sols,,,188,1.977725,49.145321
2021-1640145,2021-02-19,000002,Vente,70000,3,,RUE DU GOULET,0420,95640,95370,Marines,95,,,95370000AD0536,,,,,,,,,,,,,0,,,,,S,sols,,,315,1.977532,49.145215
2021-1640145,2021-02-19,000002,Vente,70000,3,,RUE DU GOULET,0420,95640,95370,Marines,95,,,95370000AD0537,,,,,,,,,,,,,0,,,,,S,sols,,,27,1.977587,49.145296
2021-1640161,2021-03-09,000001,Vente terrain à bâtir,142000,,,LA METAIRIE,B037,95640,95370,Marines,95,,,95370000ZC0105,,,,,,,,,,,,,0,,,,,AB,terrains a bâtir,,,829,1.972261,49.150934
2021-1641321,2021-03-22,000001,Vente,277000,1,,RUE HENRI DUNANT,0483,95640,95370,Marines,95,,,95370000AH0135,,,,,,,,,,,,,0,1,Maison,75,5,S,sols,,,497,1.986258,49.145452
2021-1641332,2021-03-25,000001,Vente,170500,61,,RUE JEAN JAURES,0560,95640,95370,Marines,95,,,95370000AC0272,,,,,,,,,,,,,0,1,Maison,44,3,S,sols,,,64,1.983462,49.1449
2021-1641332,2021-03-25,000001,Vente,170500,,,RUE JEAN JAURES,0560,95640,95370,Marines,95,,,95370000AC0273,,,,,,,,,,,,,0,,,,,S,sols,,,37,1.983533,49.144932
2021-1641693,2021-04-01,000001,Vente,225000,9,,RUE DE LA METAIRIE,0710,95640,95370,Marines,95,,,95370000ZD0053,,,18,,8,155.4,,,,,,,2,4,Local industriel. commercial ou assimilé,155,0,,,,,,1.968686,49.147013
2021-1641693,2021-04-01,000001,Vente,225000,9,,RUE DE LA METAIRIE,0710,95640,95370,Marines,95,,,95370000ZD0053,,,17,,7,155.75,,,,,,,2,4,Local industriel. commercial ou assimilé,155,0,,,,,,1.968686,49.147013
2021-1641931,2021-03-31,000001,Vente,175000,36,,RUE JEAN JAURES,0560,95640,95370,Marines,95,,,95370000AD0414,,,,,,,,,,,,,0,2,Appartement,60,4,S,sols,,,87,1.982268,49.14422
2021-1641931,2021-03-31,000001,Vente,175000,36,,RUE JEAN JAURES,0560,95640,95370,Marines,95,,,95370000AD0414,,,,,,,,,,,,,0,4,Local industriel. commercial ou assimilé,72,0,S,sols,,,87,1.982268,49.14422
2021-1641967,2021-03-23,000001,Vente,290000,3,,RUE JOSEPH CHERON,0600,95640,95370,Marines,95,,,95370000AH0155,,,,,,,,,,,,,0,1,Maison,144,5,S,sols,,,411,1.9887,49.145544
2021-1642322,2021-04-09,000001,Vente terrain à bâtir,157000,,,LA METAIRIE,B037,95640,95370,Marines,95,,,95370000ZC0104,,,,,,,,,,,,,0,,,,,AB,terrains a bâtir,,,517,1.972081,49.150538
2021-1642523,2021-04-02,000001,Vente,422000,19,,RUE DES HAUTIERS,0460,95640,95370,Marines,95,,,95370000AH0016,,,,,,,,,,,,,0,1,Maison,107,6,J,jardins,POTAG,Jardin potager,708,1.984583,49.149263
2021-1642523,2021-04-02,000001,Vente,422000,19,,RUE DES HAUTIERS,0460,95640,95370,Marines,95,,,95370000AH0016,,,,,,,,,,,,,0,1,Maison,107,6,S,sols,,,492,1.984583,49.149263
2021-1642523,2021-04-02,000001,Vente,422000,,,LE CHEMIN DES ANGLAIS,B020,95640,95370,Marines,95,,,95370000AH0020,,,,,,,,,,,,,0,,,,,J,jardins,POTAG,Jardin potager,360,1.984204,49.149475
2021-1642523,2021-04-02,000001,Vente,422000,,,LE CHEMIN DES ANGLAIS,B020,95640,95370,Marines,95,,,95370000AH0021,,,,,,,,,,,,,0,,,,,J,jardins,POTAG,Jardin potager,290,1.984147,49.149405
2021-1642523,2021-04-02,000001,Vente,422000,,,LE CHEMIN DES ANGLAIS,B020,95640,95370,Marines,95,,,95370000AH0022,,,,,,,,,,,,,0,,,,,J,jardins,POTAG,Jardin potager,420,1.98405,49.149269
2021-1642800,2021-04-15,000001,Vente,87324,10,B,RUE DE LA RICHARDERIE,0825,95640,95370,Marines,95,,,95370000ZD0279,,,,,,,,,,,,,0,,,,,AB,terrains a bâtir,,,1915,1.967959,49.144097
2021-1642895,2021-04-24,000001,Vente,16000,,,RUE JEAN JAURES,0560,95640,95370,Marines,95,,,95370000AC0084,,,,,,,,,,,,,0,,,,,J,jardins,POTAG,Jardin potager,252,1.98512,49.145201
2021-1643181,2021-04-21,000001,Vente,225000,73,,RUE JEAN JAURES,0560,95640,95370,Marines,95,,,95370000AC0283,,,,,,,,,,,,,0,1,Maison,100,4,S,sols,,,166,1.983709,49.145114
2021-1643181,2021-04-21,000001,Vente,225000,,,RUE JEAN JAURES,0560,95640,95370,Marines,95,,,95370000AC0286,,,,,,,,,,,,,0,,,,,S,sols,,,79,1.983835,49.145142
2021-1643599,2021-04-29,000001,Vente,85000,,,PL AMIRAL ERNEST PEYRON,0010,95640,95370,Marines,95,,,95370000AD0218,,,,,,,,,,,,,0,,,,,S,sols,,,443,1.980919,49.143288
2021-1643688,2021-04-30,000001,Vente,570000,1,,RUE DE GOUY,0440,95640,95370,Marines,95,,,95370000AD0024,,,,,,,,,,,,,0,2,Appartement,35,2,S,sols,,,479,1.979295,49.145074
2021-1643688,2021-04-30,000001,Vente,570000,1,,RUE DE GOUY,0440,95640,95370,Marines,95,,,95370000AD0024,,,,,,,,,,,,,0,2,Appartement,56,2,S,sols,,,479,1.979295,49.145074
2021-1643688,2021-04-30,000001,Vente,570000,1,,RUE DE GOUY,0440,95640,95370,Marines,95,,,95370000AD0024,,,,,,,,,,,,,0,2,Appartement,55,2,S,sols,,,479,1.979295,49.145074
2021-1643688,2021-04-30,000001,Vente,570000,1,,RUE DE GOUY,0440,95640,95370,Marines,95,,,95370000AD0024,,,,,,,,,,,,,0,2,Appartement,37,2,S,sols,,,479,1.979295,49.145074
2021-1643688,2021-04-30,000001,Vente,570000,1,,RUE DE GOUY,0440,95640,95370,Marines,95,,,95370000AD0024,,,,,,,,,,,,,0,2,Appartement,40,2,S,sols,,,479,1.979295,49.145074
2021-1643688,2021-04-30,000001,Vente,570000,1,,RUE DE GOUY,0440,95640,95370,Marines,95,,,95370000AD0024,,,,,,,,,,,,,0,2,Appartement,60,2,S,sols,,,479,1.979295,49.145074
2021-1643868,2021-04-28,000001,Vente terrain à bâtir,134000,37,,ALL DE LA METAIRIE,0705,95640,95370,Marines,95,,,95370000ZC0124,,,,,,,,,,,,,0,,,,,AB,terrains a bâtir,,,476,1.970739,49.151253
2021-1644188,2021-05-10,000001,Vente,165000,,,PL AMIRAL ERNEST PEYRON,0010,95640,95370,Marines,95,,,95370000AD0218,,,,,,,,,,,,,0,,,,,S,sols,,,443,1.980919,49.143288
2021-1644188,2021-05-10,000001,Vente,165000,23,,PL AMIRAL ERNEST PEYRON,0010,95640,95370,Marines,95,,,95370000AD0223,,,,,,,,,,,,,0,3,Dépendance,,0,S,sols,,,49,1.981126,49.143297
2021-1644188,2021-05-10,000001,Vente,165000,23,,PL AMIRAL ERNEST PEYRON,0010,95640,95370,Marines,95,,,95370000AD0223,,,,,,,,,,,,,0,2,Appartement,70,3,S,sols,,,49,1.981126,49.143297
2021-1644255,2021-05-11,000001,Vente terrain à bâtir,172000,35,,ALL DE LA METAIRIE,0705,95640,95370,Marines,95,,,95370000ZC0123,,,,,,,,,,,,,0,,,,,AB,terrains a bâtir,,,1704,1.970995,49.151449
2021-1645430,2021-05-31,000001,Vente terrain à bâtir,131000,39,,ALL DE LA METAIRIE,0705,95640,95370,Marines,95,,,95370000ZC0125,,,,,,,,,,,,,0,,,,,AB,terrains a bâtir,,,501,1.970698,49.151136
2021-1645600,2021-05-11,000001,Vente,161500,2,,RUE SAINTE BARBE,0880,95640,95370,Marines,95,,,95370000AC0237,,,,,,,,,,,,,0,1,Maison,59,0,S,sols,,,123,1.981371,49.144163
2021-1645600,2021-05-11,000001,Vente,161500,2,,RUE SAINTE BARBE,0880,95640,95370,Marines,95,,,95370000AC0237,,,,,,,,,,,,,0,1,Maison,51,3,S,sols,,,123,1.981371,49.144163
2021-1645784,2021-06-01,000001,Vente,347000,6,B,RUE ANDRE BALEYDIER,0020,95640,95370,Marines,95,,,95370000AC0140,,,,,,,,,,,,,0,1,Maison,72,4,S,sols,,,571,1.98412,49.144482
2021-1645784,2021-06-01,000001,Vente,347000,6,B,RUE ANDRE BALEYDIER,0020,95640,95370,Marines,95,,,95370000AC0140,,,,,,,,,,,,,0,3,Dépendance,,0,S,sols,,,571,1.98412,49.144482
2021-1645834,2021-05-28,000001,Vente,68000,1,,BD DE LA REPUBLIQUE,0820,95640,95370,Marines,95,,,95370000AD0540,,,81,,,,,,,,,,1,3,Dépendance,,0,,,,,,1.981356,49.142979
2021-1645834,2021-05-28,000001,Vente,68000,1,,BD DE LA REPUBLIQUE,0820,95640,95370,Marines,95,,,95370000AD0540,,,81,,92,16.15,,,,,,,2,2,Appartement,19,1,,,,,,1.981356,49.142979
2021-1646026,2021-06-03,000001,Vente,69570,1,,BD DE LA REPUBLIQUE,0820,95640,95370,Marines,95,,,95370000AD0540,,,93,17.06,,,,,,,,,1,2,Appartement,18,1,,,,,,1.981356,49.142979
2021-1646026,2021-06-03,000001,Vente,69570,1,,BD DE LA REPUBLIQUE,0820,95640,95370,Marines,95,,,95370000AD0540,,,93,17.06,,,,,,,,,1,3,Dépendance,,0,,,,,,1.981356,49.142979
2021-1646026,2021-06-03,000001,Vente,69570,1,,BD DE LA REPUBLIQUE,0820,95640,95370,Marines,95,,,95370000AD0540,,,93,17.06,,,,,,,,,1,3,Dépendance,,0,,,,,,1.981356,49.142979
2021-1646655,2021-06-17,000001,Vente,40000,9042,,RUE DU HEAULME,0480,95640,95370,Marines,95,,,95370000AC0070,,,,,,,,,,,,,0,3,Dépendance,,0,S,sols,,,62,1.985297,49.14601
2021-1647209,2021-06-25,000001,Vente,355000,,,RUE DES HAUTIERS,0460,95640,95370,Marines,95,,,95370000AC0407,,,,,,,,,,,,,0,,,,,S,sols,,,142,1.983948,49.147328
2021-1647209,2021-06-25,000001,Vente,355000,3,,LA RUE DU CHENEL,B058,95640,95370,Marines,95,,,95370000AC0414,,,,,,,,,,,,,0,1,Maison,65,3,S,sols,,,673,1.983661,49.147035
2021-1647209,2021-06-25,000001,Vente,355000,3,,LA RUE DU CHENEL,B058,95640,95370,Marines,95,,,95370000AC0415,,,,,,,,,,,,,0,,,,,S,sols,,,109,1.983758,49.147231
2021-1647245,2021-06-28,000002,Vente,224650,4,,RUE EMILE PETIT,0345,95640,95370,Marines,95,,,95370000AD0542,,,,,,,,,,,,,0,3,Dépendance,,0,S,sols,,,154,1.981954,49.142148
2021-1647245,2021-06-28,000002,Vente,224650,4,,RUE EMILE PETIT,0345,95640,95370,Marines,95,,,95370000AD0542,,,,,,,,,,,,,0,1,Maison,23,1,S,sols,,,154,1.981954,49.142148
2021-1647245,2021-06-28,000002,Vente,224650,4,,RUE EMILE PETIT,0345,95640,95370,Marines,95,,,95370000AD0542,,,,,,,,,,,,,0,1,Maison,51,2,S,sols,,,154,1.981954,49.142148
2021-1647245,2021-06-28,000002,Vente,224650,4,,RUE EMILE PETIT,0345,95640,95370,Marines,95,,,95370000AD0542,,,,,,,,,,,,,0,3,Dépendance,,0,S,sols,,,154,1.981954,49.142148
2021-1647245,2021-06-28,000002,Vente,224650,4,,RUE EMILE PETIT,0345,95640,95370,Marines,95,,,95370000AD0542,,,,,,,,,,,,,0,1,Maison,102,4,S,sols,,,154,1.981954,49.142148
2021-1647245,2021-06-28,000002,Vente,224650,,,RUE EMILE PETIT,0345,95640,95370,Marines,95,,,95370000AD0544,,,,,,,,,,,,,0,,,,,S,sols,,,13,1.982047,49.142214
2021-1647527,2021-07-05,000001,Vente,110000,10,,RUE DU DOCTEUR MEYNARD,0300,95640,95370,Marines,95,,,95370000AD0508,,,,,,,,,,,,,0,3,Dépendance,,0,S,sols,,,384,1.978999,49.145568
2021-1647527,2021-07-05,000001,Vente,110000,10,,RUE DU DOCTEUR MEYNARD,0300,95640,95370,Marines,95,,,95370000AD0508,,,,,,,,,,,,,0,3,Dépendance,,0,S,sols,,,384,1.978999,49.145568
2021-1647739,2021-07-07,000001,Vente,260000,80,,RUE JEAN JAURES,0560,95640,95370,Marines,95,,,95370000AC0126,,,,,,,,,,,,,0,1,Maison,72,5,S,sols,,,222,1.984295,49.144974
2021-1648185,2021-07-09,000001,Vente,1010000,18,,BD DE LA REPUBLIQUE,0820,95640,95370,Marines,95,,,953700000D0237,,,,,,,,,,,,,0,3,Dépendance,,0,S,sols,,,2265,1.98759,49.136444
2021-1648185,2021-07-09,000001,Vente,1010000,18,,BD DE LA REPUBLIQUE,0820,95640,95370,Marines,95,,,953700000D0237,,,,,,,,,,,,,0,3,Dépendance,,0,S,sols,,,2265,1.98759,49.136444
2021-1648185,2021-07-09,000001,Vente,1010000,18,,BD DE LA REPUBLIQUE,0820,95640,95370,Marines,95,,,953700000D0237,,,,,,,,,,,,,0,2,Appartement,86,3,S,sols,,,2265,1.98759,49.136444
2021-1648185,2021-07-09,000001,Vente,1010000,18,,BD DE LA REPUBLIQUE,0820,95640,95370,Marines,95,,,953700000D0237,,,,,,,,,,,,,0,3,Dépendance,,0,S,sols,,,2265,1.98759,49.136444
2021-1648185,2021-07-09,000001,Vente,1010000,18,,BD DE LA REPUBLIQUE,0820,95640,95370,Marines,95,,,953700000D0237,,,,,,,,,,,,,0,3,Dépendance,,0,S,sols,,,2265,1.98759,49.136444
2021-1648185,2021-07-09,000001,Vente,1010000,18,,BD DE LA REPUBLIQUE,0820,95640,95370,Marines,95,,,953700000D0237,,,,,,,,,,,,,0,2,Appartement,60,3,S,sols,,,2265,1.98759,49.136444
2021-1648185,2021-07-09,000001,Vente,1010000,18,,BD DE LA REPUBLIQUE,0820,95640,95370,Marines,95,,,953700000D0237,,,,,,,,,,,,,0,2,Appartement,173,5,S,sols,,,2265,1.98759,49.136444
2021-1648185,2021-07-09,000001,Vente,1010000,18,,BD DE LA REPUBLIQUE,0820,95640,95370,Marines,95,,,953700000D0237,,,,,,,,,,,,,0,3,Dépendance,,0,S,sols,,,2265,1.98759,49.136444
2021-1648185,2021-07-09,000001,Vente,1010000,18,,BD DE LA REPUBLIQUE,0820,95640,95370,Marines,95,,,953700000D0237,,,,,,,,,,,,,0,1,Maison,91,3,S,sols,,,2265,1.98759,49.136444
2021-1648185,2021-07-09,000001,Vente,1010000,18,,BD DE LA REPUBLIQUE,0820,95640,95370,Marines,95,,,953700000D0237,,,,,,,,,,,,,0,4,Local industriel. commercial ou assimilé,515,0,S,sols,,,2265,1.98759,49.136444
2021-1648185,2021-07-09,000001,Vente,1010000,18,,BD DE LA REPUBLIQUE,0820,95640,95370,Marines,95,,,953700000D0237,,,,,,,,,,,,,0,3,Dépendance,,0,S,sols,,,2265,1.98759,49.136444
2021-1648185,2021-07-09,000001,Vente,1010000,,,LA PISSOTTE,B045,95640,95370,Marines,95,,,953700000D0238,,,,,,,,,,,,,0,,,,,J,jardins,POTAG,Jardin potager,650,1.988008,49.136105
2021-1648185,2021-07-09,000001,Vente,1010000,,,LA PISSOTTE,B045,95640,95370,Marines,95,,,953700000D0360,,,,,,,,,,,,,0,,,,,T,terres,,,1242,1.986179,49.136899
2021-1648185,2021-07-09,000001,Vente,1010000,18,,BD DE LA REPUBLIQUE,0820,95640,95370,Marines,95,,,953700000D0430,,,,,,,,,,,,,0,3,Dépendance,,0,AG,terrains d'agrément,,,13174,1.987183,49.136476
2021-1648327,2021-06-30,000001,Vente,225000,6,,RUE DU HEAULME,0480,95640,95370,Marines,95,,,95370000AC0443,,,29,,,,,,,,,,1,2,Appartement,80,3,,,,,,1.98544,49.145688
2021-1648327,2021-06-30,000001,Vente,225000,6,,RUE DU HEAULME,0480,95640,95370,Marines,95,,,95370000AC0443,,,13,,,,,,,,,,1,3,Dépendance,,0,,,,,,1.98544,49.145688
2021-1648376,2021-07-08,000001,Vente,317150,19,,RUE JEAN BAPTISTE CARTRY,0540,95640,95370,Marines,95,,,95370000AC0025,,,,,,,,,,,,,0,1,Maison,89,4,S,sols,,,460,1.980374,49.14662
2021-1648476,2021-06-24,000001,Vente,365000,,,RUE MALEBRANCHE,0640,95640,95370,Marines,95,,,95370000AC0312,,,,,,,,,,,,,0,,,,,S,sols,,,47,1.982644,49.146041
2021-1648476,2021-06-24,000001,Vente,365000,15,,RUE MALEBRANCHE,0640,95640,95370,Marines,95,,,95370000AC0313,,,,,,,,,,,,,0,1,Maison,80,4,S,sols,,,813,1.982424,49.146122
2021-1648682,2021-07-12,000001,Vente,342000,26,,RUE ANDRE BALEYDIER,0020,95640,95370,Marines,95,,,95370000AC0113,,,1,156.14,,,,,,,,,1,2,Appartement,166,4,,,,,,1.985498,49.144614
2021-1648682,2021-07-12,000001,Vente,342000,26,,RUE ANDRE BALEYDIER,0020,95640,95370,Marines,95,,,95370000AC0113,,,1,156.14,,,,,,,,,1,3,Dépendance,,0,,,,,,1.985498,49.144614
2021-1648682,2021-07-12,000001,Vente,342000,26,,RUE ANDRE BALEYDIER,0020,95640,95370,Marines,95,,,95370000AC0113,,,1,156.14,,,,,,,,,1,3,Dépendance,,0,,,,,,1.985498,49.144614
2021-1649020,2021-07-09,000001,Vente,336400,4,,ALL PAUL GAUGUIN,0789,95640,95370,Marines,95,,,95370000AB0091,,,,,,,,,,,,,0,1,Maison,116,5,S,sols,,,481,1.98005,49.148468
2021-1649610,2021-07-21,000001,Vente terrain à bâtir,130000,22,,ALL DE LA METAIRIE,0705,95640,95370,Marines,95,,,95370000ZC0115,,,,,,,,,,,,,0,,,,,AB,terrains a bâtir,,,254,1.971034,49.151041
2021-1649786,2021-07-09,000001,Vente,515000,9,,PL DU MARECHAL LECLERC,0700,95640,95370,Marines,95,,,95370000AC0351,,,,,,,,,,,,,0,,,,,S,sols,,,209,1.982419,49.145093
2021-1650245,2021-07-23,000001,Vente terrain à bâtir,161000,13,,ALL DE LA METAIRIE,0705,95640,95370,Marines,95,,,95370000ZC0102,,,,,,,,,,,,,0,,,,,AB,terrains a bâtir,,,839,1.971869,49.150353
2021-1650262,2021-08-03,000001,Vente,517000,9037,,RUE DES HAUTIERS,0460,95640,95370,Marines,95,,,95370000AH0015,,,,,,,,,,,,,0,1,Maison,189,7,J,jardins,POTAG,Jardin potager,1767,1.984493,49.148592
2021-1650262,2021-08-03,000001,Vente,517000,9037,,RUE DES HAUTIERS,0460,95640,95370,Marines,95,,,95370000AH0015,,,,,,,,,,,,,0,1,Maison,189,7,S,sols,,,556,1.984493,49.148592
2021-1650285,2021-07-22,000001,Vente terrain à bâtir,131000,12,,ALL DE LA METAIRIE,0705,95640,95370,Marines,95,,,95370000ZC0110,,,,,,,,,,,,,0,,,,,AB,terrains a bâtir,,,302,1.971777,49.150793
2021-1650630,2021-07-15,000001,Vente,238800,43,,RUE DU MARECHAL FOCH,0680,95640,95370,Marines,95,,,95370000AI0124,,,,,,,,,,,,,0,1,Maison,45,3,S,sols,,,500,1.987397,49.153235
2021-1650630,2021-07-15,000001,Vente,238800,43,,RUE DU MARECHAL FOCH,0680,95640,95370,Marines,95,,,95370000AI0124,,,,,,,,,,,,,0,1,Maison,45,3,J,jardins,POTAG,Jardin potager,543,1.987397,49.153235
2021-1650686,2021-08-10,000001,Vente,270000,,,PL AMIRAL ERNEST PEYRON,0010,95640,95370,Marines,95,,,95370000AD0218,,,,,,,,,,,,,0,,,,,S,sols,,,443,1.980919,49.143288
2021-1650686,2021-08-10,000001,Vente,270000,,,PL AMIRAL ERNEST PEYRON,0010,95640,95370,Marines,95,,,95370000AD0220,,,,,,,,,,,,,0,,,,,S,sols,,,5,1.981127,49.143224
2021-1650686,2021-08-10,000001,Vente,270000,,,PL AMIRAL ERNEST PEYRON,0010,95640,95370,Marines,95,,,95370000AD0221,,,,,,,,,,,,,0,,,,,S,sols,,,10,1.981145,49.143184
2021-1650686,2021-08-10,000001,Vente,270000,9032,,PL AMIRAL ERNEST PEYRON,0010,95640,95370,Marines,95,,,95370000AD0222,,,,,,,,,,,,,0,1,Maison,140,5,S,sols,,,201,1.981219,49.143164
2021-1651869,2021-09-02,000001,Vente,138750,51,,RUE JEAN JAURES,0560,95640,95370,Marines,95,,,95370000AC0208,,,,,,,,,,,,,0,1,Maison,40,3,S,sols,,,40,1.982582,49.144668
2021-1651888,2021-09-01,000001,Vente,156000,6,,RUE DU HEAULME,0480,95640,95370,Marines,95,,,95370000AC0443,,,16,,44,53,,,,,,,2,3,Dépendance,,0,,,,,,1.98544,49.145688
2021-1651888,2021-09-01,000001,Vente,156000,6,,RUE DU HEAULME,0480,95640,95370,Marines,95,,,95370000AC0443,,,16,,44,53,,,,,,,2,2,Appartement,52,2,,,,,,1.98544,49.145688
2021-1651888,2021-09-01,000001,Vente,156000,6,,RUE DU HEAULME,0480,95640,95370,Marines,95,,,95370000AC0443,,,16,,44,53,,,,,,,2,3,Dépendance,,0,,,,,,1.98544,49.145688
2021-1652017,2021-08-24,000001,Vente,160000,,,RUE DU GOULET,0420,95640,95370,Marines,95,,,95370000AA0019,,,38,,39,,40,,41,,6,187,5,4,Local industriel. commercial ou assimilé,1,0,,,,,,1.975068,49.14394
2021-1652036,2021-09-03,000002,Vente,325000,62,,RUE DU MARECHAL FOCH,0680,95640,95370,Marines,95,,,95370000AI0229,,,,,,,,,,,,,0,1,Maison,88,4,S,sols,,,508,1.988124,49.153823
2021-1652038,2021-09-03,000001,Vente,239925,26,T,RUE DU GENERAL DE GAULLE,0400,95640,95370,Marines,95,,,95370000AD0468,,,,,,,,,,,,,0,1,Maison,76,4,S,sols,,,71,1.978915,49.144929
2021-1652175,2021-08-30,000001,Vente,237248,17,,RUE ANDRE BALEYDIER,0020,95640,95370,Marines,95,,,95370000AC0097,,,,,,,,,,,,,0,1,Maison,72,3,S,sols,,,90,1.986006,49.145113
2021-1652231,2021-08-20,000001,Vente,470000,12,,RTE DE BREANCON,0056,95640,95370,Marines,95,,,95370000AE0163,,,,,,,,,,,,,0,1,Maison,162,6,S,sols,,,800,1.98696,49.138843
2021-1652294,2021-08-26,000001,Vente,389000,22,,ALL CHARLES FRANCOIS DAUBIGNY,0167,95640,95370,Marines,95,,,95370000AB0143,,,,,,,,,,,,,0,1,Maison,152,7,S,sols,,,401,1.977973,49.147662
2021-1653142,2021-09-21,000001,Vente,265600,49,,AV DES MURGERS,0821,95640,95370,Marines,95,,,95370000AB0174,,,,,,,,,,,,,0,1,Maison,91,4,S,sols,,,251,1.97879,49.147432
2021-1653497,2021-09-21,000001,Vente,52000,,,LES CRESSONS,B023,95640,95370,Marines,95,,,953700000A0236,,,,,,,,,,,,,0,,,,,BS,taillis sous futaie,,,3420,1.986085,49.158751