id_mutation,date_mutation,numero_disposition,nature_mutation,valeur_fonciere,adresse_numero,adresse_suffixe,adresse_nom_voie,adresse_code_voie,code_postal,code_commune,nom_commune,code_departement,ancien_code_commune,ancien_nom_commune,id_parcelle,ancien_id_parcelle,numero_volume,lot1_numero,lot1_surface_carrez,lot2_numero,lot2_surface_carrez,lot3_numero,lot3_surface_carrez,lot4_numero,lot4_surface_carrez,lot5_numero,lot5_surface_carrez,nombre_lots,code_type_local,type_local,surface_reelle_bati,nombre_pieces_principales,code_nature_culture,nature_culture,code_nature_culture_speciale,nature_culture_speciale,surface_terrain,longitude,latitude
2021-1644814,2021-05-18,000001,Vente,505000,,,LE VILLAGE,B023,95810,95387,Menouville,95,,,953870000B0008,,,,,,,,,,,,,0,,,,,BT,taillis simples,,,630,2.111927,49.14965
2021-1644814,2021-05-18,000001,Vente,505000,,,LE VILLAGE,B023,95810,95387,Menouville,95,,,953870000B0009,,,,,,,,,,,,,0,,,,,BS,taillis sous futaie,,,536,2.112078,49.149746
2021-1644814,2021-05-18,000001,Vente,505000,,,LE VILLAGE,B023,95810,95387,Menouville,95,,,953870000B0010,,,,,,,,,,,,,0,,,,,BS,taillis sous futaie,,,200,2.111981,49.149928
2021-1644814,2021-05-18,000001,Vente,505000,,,LE VILLAGE,B023,95810,95387,Menouville,95,,,953870000B0011,,,,,,,,,,,,,0,,,,,BS,taillis sous futaie,,,1150,2.111854,49.149994
2021-1644814,2021-05-18,000001,Vente,505000,,,LE VILLAGE,B023,95810,95387,Menouville,95,,,953870000B0012,,,,,,,,,,,,,0,,,,,BS,taillis sous futaie,,,420,2.111766,49.149908
2021-1644814,2021-05-18,000001,Vente,505000,,,AU DESSUS DU MOULIN,B009,95810,95387,Menouville,95,,,953870000B0123,,,,,,,,,,,,,0,,,,,BS,taillis sous futaie,,,810,2.112521,49.150187
2021-1644814,2021-05-18,000001,Vente,505000,,,AU DESSUS DU MOULIN,B009,95810,95387,Menouville,95,,,953870000B0125,,,,,,,,,,,,,0,,,,,T,terres,,,1354,2.112676,49.149655
2021-1644814,2021-05-18,000001,Vente,505000,,,AU DESSUS DU MOULIN,B009,95810,95387,Menouville,95,,,953870000B0125,,,,,,,,,,,,,0,,,,,T,terres,,,1355,2.112676,49.149655
2021-1644814,2021-05-18,000001,Vente,505000,5007,,AU DESSUS DU MOULIN,B009,95810,95387,Menouville,95,,,953870000B0168,,,,,,,,,,,,,0,1,Maison,26,2,S,sols,,,201,2.113058,49.149882
2021-1644814,2021-05-18,000001,Vente,505000,10,,RUE DU MOULIN,0030,95810,95387,Menouville,95,,,953870000B0217,,,,,,,,,,,,,0,1,Maison,186,6,S,sols,,,800,2.11337,49.15028
2021-1644814,2021-05-18,000001,Vente,505000,10,,RUE DU MOULIN,0030,95810,95387,Menouville,95,,,953870000B0217,,,,,,,,,,,,,0,1,Maison,186,6,AG,terrains d'agrément,,,4660,2.11337,49.15028
2021-1655563,2021-10-05,000001,Vente,470000,,,LE VILLAGE,B023,95810,95387,Menouville,95,,,953870000B0203,,,,,,,,,,,,,0,,,,,J,jardins,,,678,2.109478,49.150591
2021-1655563,2021-10-05,000001,Vente,470000,5023,,LE VILLAGE,B023,95810,95387,Menouville,95,,,953870000B0205,,,,,,,,,,,,,0,3,Dépendance,,0,S,sols,,,635,2.10985,49.15075
2021-1655563,2021-10-05,000001,Vente,470000,5023,,LE VILLAGE,B023,95810,95387,Menouville,95,,,953870000B0205,,,,,,,,,,,,,0,1,Maison,108,3,S,sols,,,635,2.10985,49.15075
2021-1655563,2021-10-05,000001,Vente,470000,5023,,LE VILLAGE,B023,95810,95387,Menouville,95,,,953870000B0205,,,,,,,,,,,,,0,3,Dépendance,,0,S,sols,,,635,2.10985,49.15075
2021-1655563,2021-10-05,000001,Vente,470000,5023,,LE VILLAGE,B023,95810,95387,Menouville,95,,,953870000B0205,,,,,,,,,,,,,0,3,Dépendance,,0,S,sols,,,635,2.10985,49.15075
2021-1655563,2021-10-05,000001,Vente,470000,,,LE VILLAGE,B023,95810,95387,Menouville,95,,,953870000B0208,,,,,,,,,,,,,0,,,,,S,sols,,,33,2.109628,49.150805
2021-1655563,2021-10-05,000001,Vente,470000,,,LE VILLAGE,B023,95810,95387,Menouville,95,,,953870000B0210,,,,,,,,,,,,,0,,,,,J,jardins,,,49,2.109531,49.150741
