id_mutation,date_mutation,numero_disposition,nature_mutation,valeur_fonciere,adresse_numero,adresse_suffixe,adresse_nom_voie,adresse_code_voie,code_postal,code_commune,nom_commune,code_departement,ancien_code_commune,ancien_nom_commune,id_parcelle,ancien_id_parcelle,numero_volume,lot1_numero,lot1_surface_carrez,lot2_numero,lot2_surface_carrez,lot3_numero,lot3_surface_carrez,lot4_numero,lot4_surface_carrez,lot5_numero,lot5_surface_carrez,nombre_lots,code_type_local,type_local,surface_reelle_bati,nombre_pieces_principales,code_nature_culture,nature_culture,code_nature_culture_speciale,nature_culture_speciale,surface_terrain,longitude,latitude
2021-1639241,2021-01-15,000001,Vente,254680,12,,RUE NARCISSE AUSSENARD,0110,95450,95535,Sagy,95,,,955350000D2294,,,1,102.52,,,,,,,,,1,1,Maison,82,5,,,,,,1.959019,49.055866
2021-1639354,2021-01-22,000001,Vente,303424,6,,CHE DE L AUNAY,0024,95450,95535,Sagy,95,,,95535000ZH0276,,,,,,,,,,,,,0,1,Maison,127,6,S,sols,,,1050,1.952464,49.046138
2021-1639373,2021-01-30,000001,Vente,938,,,LE CLOS DES MARAIS,B026,95450,95535,Sagy,95,,,955350000D0623,,,,,,,,,,,,,0,,,,,BF,futaies feuillues,,,508,1.956653,49.057098
2021-1639632,2021-01-22,000001,Vente,506486,,,LA POINTE,B072,95450,95535,Sagy,95,,,95535000ZK0075,,,,,,,,,,,,,0,,,,,T,terres,,,1062,1.942209,49.054669
2021-1639632,2021-01-22,000001,Vente,506486,,,LA POINTE,B072,95450,95535,Sagy,95,,,95535000ZK0075,,,,,,,,,,,,,0,,,,,T,terres,,,5314,1.942209,49.054669
2021-1639632,2021-01-22,000001,Vente,506486,,,LE FOND DES CAILLOUX,B043,95450,95535,Sagy,95,,,95535000ZK0076,,,,,,,,,,,,,0,,,,,T,terres,,,2077,1.941921,49.054725
2021-1639632,2021-01-22,000001,Vente,506486,,,LE FOND DES CAILLOUX,B043,95450,95535,Sagy,95,,,95535000ZK0076,,,,,,,,,,,,,0,,,,,T,terres,,,415,1.941921,49.054725
2021-1639632,2021-01-22,000001,Vente,506486,,,LE FOND DES CAILLOUX,B043,95450,95535,Sagy,95,,,95535000ZK0077,,,,,,,,,,,,,0,,,,,T,terres,,,18104,1.94133,49.054933
2021-1639632,2021-01-22,000001,Vente,506486,,,LE FOND DES CAILLOUX,B043,95450,95535,Sagy,95,,,95535000ZK0078,,,,,,,,,,,,,0,,,,,T,terres,,,4220,1.940716,49.055384
2021-1639632,2021-01-22,000001,Vente,506486,,,LE FOND DES CAILLOUX,B043,95450,95535,Sagy,95,,,95535000ZK0078,,,,,,,,,,,,,0,,,,,T,terres,,,2110,1.940716,49.055384
2021-1639636,2021-01-29,000001,Vente,485000,5224,,CHE DES ROCHES,0140,95450,95535,Sagy,95,,,95535000ZI0067,,,,,,,,,,,,,0,1,Maison,192,8,AG,terrains d'agrément,,,10606,1.965335,49.056186
2021-1639636,2021-01-29,000001,Vente,485000,5224,,CHE DES ROCHES,0140,95450,95535,Sagy,95,,,95535000ZI0067,,,,,,,,,,,,,0,1,Maison,192,8,S,sols,,,200,1.965335,49.056186
2021-1639901,2021-02-23,000001,Vente,352500,9,,CLOS DES GALETS,0038,95450,95535,Sagy,95,,,95535000ZI0168,,,,,,,,,,,,,0,1,Maison,132,6,S,sols,,,580,1.959593,49.056999
2021-1641952,2021-04-01,000002,Vente,1778,,,LA COUTURE DE SAGY,B033,95450,95535,Sagy,95,,,95535000ZI0256,,,,,,,,,,,,,0,,,,,S,sols,,,266,1.958569,49.048067
2021-1641952,2021-04-01,000002,Vente,1778,,,LA COUTURE DE SAGY,B033,95450,95535,Sagy,95,,,95535000ZI0272,,,,,,,,,,,,,0,,,,,AG,terrains d'agrément,,,542,1.958314,49.048161
2021-1642613,2021-04-20,000001,Vente,305000,,,LE VAUX PERSAN,B085,95450,95535,Sagy,95,,,95535000ZI0185,,,,,,,,,,,,,0,,,,,S,sols,,,50,1.952917,49.052934
2021-1642613,2021-04-20,000001,Vente,305000,15,,RUE DU VAUX PERSAN,0081,95450,95535,Sagy,95,,,95535000ZI0194,,,,,,,,,,,,,0,1,Maison,107,5,S,sols,,,501,1.953631,49.051006
2021-1642967,2021-04-27,000001,Vente,315048,,,LE VAUX PERSAN,B085,95450,95535,Sagy,95,,,95535000ZI0185,,,,,,,,,,,,,0,,,,,S,sols,,,50,1.952917,49.052934
2021-1642967,2021-04-27,000001,Vente,315048,13,,RUE DU VAUX PERSAN,0081,95450,95535,Sagy,95,,,95535000ZI0192,,,,,,,,,,,,,0,1,Maison,95,4,S,sols,,,505,1.953618,49.051357
2021-1643699,2021-04-29,000002,Vente,1481,,,LES CRONS,B038,95450,95535,Sagy,95,,,95535000ZH0297,,,,,,,,,,,,,0,,,,,T,terres,,,722,1.959515,49.047697
2021-1643948,2021-04-30,000001,Vente,190000,1,,RUE DE LA GOUPILLERE,0037,95450,95535,Sagy,95,,,955350000C0966,,,16,,2,59.74,,,,,,,2,2,Appartement,51,2,,,,,,1.973373,49.041894
2021-1644182,2021-05-11,000001,Vente,123500,18,,RUE DE LA VALLEE,0180,95450,95535,Sagy,95,,,955350000C1435,,,24,,,,,,,,,,1,3,Dépendance,,0,,,,,,1.973968,49.041218
2021-1644182,2021-05-11,000001,Vente,123500,18,,RUE DE LA VALLEE,0180,95450,95535,Sagy,95,,,955350000C1435,,,4,42.34,,,,,,,,,1,2,Appartement,40,2,,,,,,1.973968,49.041218
2021-1647689,2021-06-28,000001,Vente,5564,,,AMBRIMONT,B002,95450,95535,Sagy,95,,,955350000D0401,,,,,,,,,,,,,0,,,,,BS,taillis sous futaie,,,1040,1.955779,49.058613
2021-1649241,2021-07-20,000001,Vente,405960,3,,RUE PIERRE BONTE,0125,95450,95535,Sagy,95,,,955350000D2309,,,,,,,,,,,,,0,1,Maison,120,6,S,sols,,,1070,1.951669,49.045414
2021-1651102,2021-08-11,000001,Vente,441000,65,,RUE DE LA VALLEE,0180,95450,95535,Sagy,95,,,95535000ZH0278,,,,,,,,,,,,,0,1,Maison,133,6,S,sols,,,524,1.967321,49.044199
2021-1651102,2021-08-11,000001,Vente,441000,65,,RUE DE LA VALLEE,0180,95450,95535,Sagy,95,,,95535000ZH0278,,,,,,,,,,,,,0,1,Maison,133,6,AG,terrains d'agrément,,,600,1.967321,49.044199
2021-1651586,2021-08-27,000002,Vente,100000,53,,RUE DE LA VALLEE,0180,95450,95535,Sagy,95,,,955350000C1456,,,,,,,,,,,,,0,,,,,AB,terrains a bâtir,,,415,1.970578,49.042802
2021-1652457,2021-09-02,000001,Vente,240000,24,,RUE DE LA VALLEE,0180,95450,95535,Sagy,95,,,955350000C0965,,,,,,,,,,,,,0,3,Dépendance,,0,S,sols,,,243,1.973151,49.041765
2021-1652457,2021-09-02,000001,Vente,240000,24,,RUE DE LA VALLEE,0180,95450,95535,Sagy,95,,,955350000C0965,,,,,,,,,,,,,0,1,Maison,69,3,S,sols,,,243,1.973151,49.041765
2021-1652457,2021-09-02,000001,Vente,240000,24,,RUE DE LA VALLEE,0180,95450,95535,Sagy,95,,,955350000C0965,,,,,,,,,,,,,0,1,Maison,19,1,S,sols,,,243,1.973151,49.041765
2021-1654291,2021-09-30,000001,Vente,372352,,,LE VAUX PERSAN,B085,95450,95535,Sagy,95,,,95535000ZI0185,,,,,,,,,,,,,0,,,,,S,sols,,,50,1.952917,49.052934
2021-1654291,2021-09-30,000001,Vente,372352,8,,RUE DU VAUX PERSAN,0081,95450,95535,Sagy,95,,,95535000ZI0187,,,,,,,,,,,,,0,1,Maison,79,4,S,sols,,,522,1.953189,49.052112
2021-1654555,2021-09-27,000001,Vente,230000,,,LE GRAND MESNIL,B053,95450,95535,Sagy,95,,,955350000D2095,,,,,,,,,,,,,0,,,,,J,jardins,POTAG,Jardin potager,686,1.958958,49.056505
2021-1654555,2021-09-27,000001,Vente,230000,2,B,RUE D AMBRIMONT,0020,95450,95535,Sagy,95,,,955350000D2097,,,,,,,,,,,,,0,1,Maison,120,5,S,sols,,,724,1.958743,49.056318
2021-1654565,2021-10-09,000001,Vente,285000,11,,RUE DE LA VALLEE,0180,95450,95535,Sagy,95,,,955350000C1279,,,103,,42,94.6,43,,44,,51,,9,1,Maison,105,5,,,,,,1.973896,49.040045
2021-1654565,2021-10-09,000001,Vente,285000,1,D,RUE DE LA VALLEE,0180,95450,95535,Sagy,95,,,955350000C1279,,,92,,,,,,,,,,1,3,Dépendance,,0,,,,,,1.973896,49.040045
2021-1654565,2021-10-09,000001,Vente,285000,11,,RUE DE LA VALLEE,0180,95450,95535,Sagy,95,,,955350000C1279,,,93,,,,,,,,,,1,3,Dépendance,,0,,,,,,1.973896,49.040045
2021-1656932,2021-11-02,000001,Vente,450000,67,,RUE DE LA VALLEE,0180,95450,95535,Sagy,95,,,95535000ZH0286,,,,,,,,,,,,,0,1,Maison,108,4,S,sols,,,3467,1.966403,49.044298
2021-1656932,2021-11-02,000001,Vente,450000,67,,RUE DE LA VALLEE,0180,95450,95535,Sagy,95,,,95535000ZH0286,,,,,,,,,,,,,0,4,Local industriel. commercial ou assimilé,400,0,S,sols,,,3467,1.966403,49.044298
2021-1657124,2021-11-08,000001,Vente,560000,22,,RUE DE LA VALLEE,0180,95450,95535,Sagy,95,,,955350000C1323,,,,,,,,,,,,,0,1,Maison,100,5,S,sols,,,1027,1.973303,49.041267
2021-1659021,2021-12-15,000001,Vente,346400,19,,RUE DE LA VALLEE,0180,95450,95535,Sagy,95,,,955350000C1043,,,,,,,,,,,,,0,3,Dépendance,,0,S,sols,,,315,1.973721,49.040362
2021-1659021,2021-12-15,000001,Vente,346400,19,,RUE DE LA VALLEE,0180,95450,95535,Sagy,95,,,955350000C1043,,,,,,,,,,,,,0,1,Maison,110,5,S,sols,,,315,1.973721,49.040362
2021-1659721,2021-12-30,000001,Vente,190000,,,LE VILLAGE,B087,95450,95535,Sagy,95,,,955350000D2235,,,,,,,,,,,,,0,,,,,S,sols,,,25,1.952513,49.050889
2021-1659721,2021-12-30,000001,Vente,190000,10,,RUE MAURICE VAUVILLIER,0084,95450,95535,Sagy,95,,,95535000ZI0267,,,,,,,,,,,,,0,1,Maison,114,4,AG,terrains d'agrément,,,654,1.952713,49.050984
2021-1659721,2021-12-30,000001,Vente,190000,10,,RUE MAURICE VAUVILLIER,0084,95450,95535,Sagy,95,,,95535000ZI0267,,,,,,,,,,,,,0,1,Maison,114,4,S,sols,,,500,1.952713,49.050984
