id_mutation,date_mutation,numero_disposition,nature_mutation,valeur_fonciere,adresse_numero,adresse_suffixe,adresse_nom_voie,adresse_code_voie,code_postal,code_commune,nom_commune,code_departement,ancien_code_commune,ancien_nom_commune,id_parcelle,ancien_id_parcelle,numero_volume,lot1_numero,lot1_surface_carrez,lot2_numero,lot2_surface_carrez,lot3_numero,lot3_surface_carrez,lot4_numero,lot4_surface_carrez,lot5_numero,lot5_surface_carrez,nombre_lots,code_type_local,type_local,surface_reelle_bati,nombre_pieces_principales,code_nature_culture,nature_culture,code_nature_culture_speciale,nature_culture_speciale,surface_terrain,longitude,latitude
2021-1666483,2021-03-04,000001,Vente,220000,40,,CHE DU MAHOGANY,0102,97218,97203,Basse-Pointe,972,,,972030000M0049,,,,,,,,,,,,,0,1,Maison,180,5,T,terres,,,1019,-61.134611,14.856785
2021-1666483,2021-03-04,000001,Vente,220000,40,,CHE DU MAHOGANY,0102,97218,97203,Basse-Pointe,972,,,972030000M0049,,,,,,,,,,,,,0,1,Maison,180,5,S,sols,,,296,-61.134611,14.856785
2021-1666548,2021-03-18,000001,Vente,130000,10,,RUE EMILE RAMIN,0016,97218,97203,Basse-Pointe,972,,,972030000B0673,,,,,,,,,,,,,0,1,Maison,71,4,S,sols,,,312,-61.120759,14.869471
2021-1666808,2021-03-31,000001,Vente,1650000,,,HACKAERT NORD,B044,97218,97203,Basse-Pointe,972,,,972030000B0179,,,,,,,,,,,,,0,,,,,S,sols,,,31,-61.122563,14.867757
2021-1666808,2021-03-31,000001,Vente,1650000,,,HACKAERT NORD,B044,97218,97203,Basse-Pointe,972,,,972030000B0180,,,,,,,,,,,,,0,,,,,S,sols,,,78,-61.122646,14.867789
2021-1666808,2021-03-31,000001,Vente,1650000,,,HACKAERT NORD,B044,97218,97203,Basse-Pointe,972,,,972030000B0501,,,,,,,,,,,,,0,,,,,S,sols,,,2536,-61.122535,14.867916
2021-1666808,2021-03-31,000001,Vente,1650000,5505,F,HACKAERT NORD,B044,97218,97203,Basse-Pointe,972,,,972030000B0505,,,,,,,,,,,,,0,4,Local industriel. commercial ou assimilé,38,0,T,terres,,,1546,-61.122082,14.867886
2021-1666808,2021-03-31,000001,Vente,1650000,5505,F,HACKAERT NORD,B044,97218,97203,Basse-Pointe,972,,,972030000B0505,,,,,,,,,,,,,0,4,Local industriel. commercial ou assimilé,954,0,T,terres,,,1546,-61.122082,14.867886
2021-1666808,2021-03-31,000001,Vente,1650000,5505,F,HACKAERT NORD,B044,97218,97203,Basse-Pointe,972,,,972030000B0505,,,,,,,,,,,,,0,4,Local industriel. commercial ou assimilé,86,0,T,terres,,,1546,-61.122082,14.867886
2021-1666808,2021-03-31,000001,Vente,1650000,5505,F,HACKAERT NORD,B044,97218,97203,Basse-Pointe,972,,,972030000B0505,,,,,,,,,,,,,0,4,Local industriel. commercial ou assimilé,387,0,T,terres,,,1546,-61.122082,14.867886
2021-1666808,2021-03-31,000001,Vente,1650000,5505,F,HACKAERT NORD,B044,97218,97203,Basse-Pointe,972,,,972030000B0505,,,,,,,,,,,,,0,4,Local industriel. commercial ou assimilé,38,0,T,terres,,,1546,-61.122082,14.867886
2021-1666808,2021-03-31,000001,Vente,1650000,5505,F,HACKAERT NORD,B044,97218,97203,Basse-Pointe,972,,,972030000B0505,,,,,,,,,,,,,0,4,Local industriel. commercial ou assimilé,30,0,T,terres,,,1546,-61.122082,14.867886
2021-1666808,2021-03-31,000001,Vente,1650000,5505,F,HACKAERT NORD,B044,97218,97203,Basse-Pointe,972,,,972030000B0505,,,,,,,,,,,,,0,4,Local industriel. commercial ou assimilé,83,0,T,terres,,,1546,-61.122082,14.867886
2021-1666808,2021-03-31,000001,Vente,1650000,5505,F,HACKAERT NORD,B044,97218,97203,Basse-Pointe,972,,,972030000B0505,,,,,,,,,,,,,0,4,Local industriel. commercial ou assimilé,30,0,S,sols,,,2110,-61.122082,14.867886
2021-1666808,2021-03-31,000001,Vente,1650000,5505,F,HACKAERT NORD,B044,97218,97203,Basse-Pointe,972,,,972030000B0505,,,,,,,,,,,,,0,4,Local industriel. commercial ou assimilé,25,0,S,sols,,,2110,-61.122082,14.867886
2021-1666808,2021-03-31,000001,Vente,1650000,5505,F,HACKAERT NORD,B044,97218,97203,Basse-Pointe,972,,,972030000B0505,,,,,,,,,,,,,0,4,Local industriel. commercial ou assimilé,30,0,T,terres,,,1546,-61.122082,14.867886
2021-1666808,2021-03-31,000001,Vente,1650000,5505,F,HACKAERT NORD,B044,97218,97203,Basse-Pointe,972,,,972030000B0505,,,,,,,,,,,,,0,4,Local industriel. commercial ou assimilé,90,0,T,terres,,,1546,-61.122082,14.867886
2021-1666808,2021-03-31,000001,Vente,1650000,5505,F,HACKAERT NORD,B044,97218,97203,Basse-Pointe,972,,,972030000B0505,,,,,,,,,,,,,0,4,Local industriel. commercial ou assimilé,93,0,T,terres,,,1546,-61.122082,14.867886
2021-1666808,2021-03-31,000001,Vente,1650000,5505,F,HACKAERT NORD,B044,97218,97203,Basse-Pointe,972,,,972030000B0505,,,,,,,,,,,,,0,4,Local industriel. commercial ou assimilé,23,0,T,terres,,,1546,-61.122082,14.867886
2021-1666808,2021-03-31,000001,Vente,1650000,5505,F,HACKAERT NORD,B044,97218,97203,Basse-Pointe,972,,,972030000B0505,,,,,,,,,,,,,0,4,Local industriel. commercial ou assimilé,45,0,T,terres,,,1546,-61.122082,14.867886
2021-1666808,2021-03-31,000001,Vente,1650000,5505,F,HACKAERT NORD,B044,97218,97203,Basse-Pointe,972,,,972030000B0505,,,,,,,,,,,,,0,4,Local industriel. commercial ou assimilé,25,0,T,terres,,,1546,-61.122082,14.867886
2021-1666808,2021-03-31,000001,Vente,1650000,5505,F,HACKAERT NORD,B044,97218,97203,Basse-Pointe,972,,,972030000B0505,,,,,,,,,,,,,0,4,Local industriel. commercial ou assimilé,30,0,T,terres,,,1546,-61.122082,14.867886
2021-1666808,2021-03-31,000001,Vente,1650000,5505,F,HACKAERT NORD,B044,97218,97203,Basse-Pointe,972,,,972030000B0505,,,,,,,,,,,,,0,4,Local industriel. commercial ou assimilé,38,0,S,sols,,,2110,-61.122082,14.867886
2021-1666808,2021-03-31,000001,Vente,1650000,5505,F,HACKAERT NORD,B044,97218,97203,Basse-Pointe,972,,,972030000B0505,,,,,,,,,,,,,0,4,Local industriel. commercial ou assimilé,45,0,S,sols,,,2110,-61.122082,14.867886
2021-1666808,2021-03-31,000001,Vente,1650000,5505,F,HACKAERT NORD,B044,97218,97203,Basse-Pointe,972,,,972030000B0505,,,,,,,,,,,,,0,4,Local industriel. commercial ou assimilé,23,0,S,sols,,,2110,-61.122082,14.867886
2021-1666808,2021-03-31,000001,Vente,1650000,5505,F,HACKAERT NORD,B044,97218,97203,Basse-Pointe,972,,,972030000B0505,,,,,,,,,,,,,0,4,Local industriel. commercial ou assimilé,93,0,S,sols,,,2110,-61.122082,14.867886
2021-1666808,2021-03-31,000001,Vente,1650000,5505,F,HACKAERT NORD,B044,97218,97203,Basse-Pointe,972,,,972030000B0505,,,,,,,,,,,,,0,4,Local industriel. commercial ou assimilé,90,0,S,sols,,,2110,-61.122082,14.867886
2021-1666808,2021-03-31,000001,Vente,1650000,5505,F,HACKAERT NORD,B044,97218,97203,Basse-Pointe,972,,,972030000B0505,,,,,,,,,,,,,0,4,Local industriel. commercial ou assimilé,38,0,S,sols,,,2110,-61.122082,14.867886
2021-1666808,2021-03-31,000001,Vente,1650000,5505,F,HACKAERT NORD,B044,97218,97203,Basse-Pointe,972,,,972030000B0505,,,,,,,,,,,,,0,4,Local industriel. commercial ou assimilé,387,0,S,sols,,,2110,-61.122082,14.867886
2021-1666808,2021-03-31,000001,Vente,1650000,5505,F,HACKAERT NORD,B044,97218,97203,Basse-Pointe,972,,,972030000B0505,,,,,,,,,,,,,0,4,Local industriel. commercial ou assimilé,86,0,S,sols,,,2110,-61.122082,14.867886
2021-1666808,2021-03-31,000001,Vente,1650000,5505,F,HACKAERT NORD,B044,97218,97203,Basse-Pointe,972,,,972030000B0505,,,,,,,,,,,,,0,4,Local industriel. commercial ou assimilé,954,0,S,sols,,,2110,-61.122082,14.867886
2021-1666808,2021-03-31,000001,Vente,1650000,5505,F,HACKAERT NORD,B044,97218,97203,Basse-Pointe,972,,,972030000B0505,,,,,,,,,,,,,0,4,Local industriel. commercial ou assimilé,30,0,S,sols,,,2110,-61.122082,14.867886
2021-1666808,2021-03-31,000001,Vente,1650000,5505,F,HACKAERT NORD,B044,97218,97203,Basse-Pointe,972,,,972030000B0505,,,,,,,,,,,,,0,4,Local industriel. commercial ou assimilé,30,0,S,sols,,,2110,-61.122082,14.867886
2021-1666808,2021-03-31,000001,Vente,1650000,5505,F,HACKAERT NORD,B044,97218,97203,Basse-Pointe,972,,,972030000B0505,,,,,,,,,,,,,0,4,Local industriel. commercial ou assimilé,83,0,S,sols,,,2110,-61.122082,14.867886
2021-1666808,2021-03-31,000001,Vente,1650000,,,HACKAERT NORD,B044,97218,97203,Basse-Pointe,972,,,972030000B0593,,,,,,,,,,,,,0,,,,,T,terres,,,292,-61.122599,14.867717
2021-1666808,2021-03-31,000001,Vente,1650000,,,HACKAERT NORD,B044,97218,97203,Basse-Pointe,972,,,972030000B0595,,,,,,,,,,,,,0,,,,,T,terres,,,506,-61.122242,14.867579
2021-1666832,2021-04-13,000001,Vente,33000,23,,RUE DU SIFFLEUR DES MONTAGNES,0043,97218,97203,Basse-Pointe,972,,,972030000N0151,,,,,,,,,,,,,0,1,Maison,55,4,S,sols,,,318,-61.108634,14.865099
2021-1666846,2021-04-13,000001,Vente,6036.98,23,,RUE DU SIFFLEUR DES MONTAGNES,0043,97218,97203,Basse-Pointe,972,,,972030000N0151,,,,,,,,,,,,,0,1,Maison,55,4,S,sols,,,318,-61.108634,14.865099
2021-1666847,2021-04-13,000001,Vente,11878.14,7,B,RUE DES PALMIERS,0047,97218,97203,Basse-Pointe,972,,,972030000B0264,,,,,,,,,,,,,0,1,Maison,49,3,AB,terrains a bâtir,,,267,-61.120983,14.867562
2021-1667152,2021-05-21,000002,Vente,70000,93,,VC DITE DE HAUTEURS BOURDON,0019,97218,97203,Basse-Pointe,972,,,972030000L0290,,,,,,,,,,,,,0,1,Maison,85,4,,,,,,-61.135965,14.851349
2021-1667152,2021-05-21,000002,Vente,70000,93,,VC DITE DE HAUTEURS BOURDON,0019,97218,97203,Basse-Pointe,972,,,972030000L0290,,,,,,,,,,,,,0,1,Maison,55,2,,,,,,-61.135965,14.851349
2021-1667220,2021-05-28,000001,Vente,75000,7,,RUE DE L'ABRICOTIER,0011,97218,97203,Basse-Pointe,972,,,972030000B0523,,,,,,,,,,,,,0,1,Maison,75,4,S,sols,,,349,-61.122664,14.870099
2021-1667220,2021-05-28,000001,Vente,75000,7,,RUE DE L'ABRICOTIER,0011,97218,97203,Basse-Pointe,972,,,972030000B0526,,,,,,,,,,,,,0,,,,,S,sols,,,55,-61.12271,14.870014
2021-1667508,2021-06-25,000001,Vente,370000,5021,,HAUTEURS DUMAS,B013,97218,97203,Basse-Pointe,972,,,972030000M0021,,,,,,,,,,,,,0,1,Maison,159,6,T,terres,,,1419,-61.133325,14.859279
2021-1667508,2021-06-25,000001,Vente,370000,5021,,HAUTEURS DUMAS,B013,97218,97203,Basse-Pointe,972,,,972030000M0021,,,,,,,,,,,,,0,1,Maison,159,6,S,sols,,,59,-61.133325,14.859279
2021-1667805,2021-07-20,000001,Vente,226500,11,,RUE DE L'ORCHIDEE,0046,97218,97203,Basse-Pointe,972,,,972030000B0329,,,,,,,,,,,,,0,1,Maison,119,4,AB,terrains a bâtir,,,520,-61.120985,14.865836
2021-1667805,2021-07-20,000001,Vente,226500,13,,RUE DE L'ORCHIDEE,0046,97218,97203,Basse-Pointe,972,,,972030000B0330,,,,,,,,,,,,,0,,,,,S,sols,,,563,-61.12111,14.865896
2021-1667867,2021-08-13,000001,Vente,84000,7,,CR CHEMIN RURAL DIT DE DEMARE,0008,97218,97203,Basse-Pointe,972,,,972030000H0443,,,,,,,,,,,,,0,,,,,S,sols,,,426,-61.120582,14.832274
2021-1667867,2021-08-13,000001,Vente,84000,7,,CR CHEMIN RURAL DIT DE DEMARE,0008,97218,97203,Basse-Pointe,972,,,972030000H0445,,,,,,,,,,,,,0,,,,,S,sols,,,997,-61.120706,14.83221
2021-1667867,2021-08-13,000001,Vente,84000,7,,CR CHEMIN RURAL DIT DE DEMARE,0008,97218,97203,Basse-Pointe,972,,,972030000H0447,,,,,,,,,,,,,0,,,,,S,sols,,,207,-61.121062,14.832323
2021-1667945,2021-08-24,000001,Vente,102000,,,HACKAERT NORD,B044,97218,97203,Basse-Pointe,972,,,972030000B0199,,,,,,,,,,,,,0,,,,,S,sols,,,301,-61.130191,14.863106
2021-1667945,2021-08-24,000001,Vente,102000,,,VC DITE DE HAUTEURS BOURDON,0019,97218,97203,Basse-Pointe,972,,,972030000B0204,,,,,,,,,,,,,0,,,,,S,sols,,,1613,-61.129169,14.863815
2021-1667945,2021-08-24,000001,Vente,102000,10,,RUE DU BALISIER,0003,97218,97203,Basse-Pointe,972,,,972030000B0214,,,,,,,,,,,,,0,,,,,AB,terrains a bâtir,,,1470,-61.128875,14.86333
2021-1668049,2021-09-03,000001,Vente,128000,9,,RUE DU RAMIER,0050,97218,97203,Basse-Pointe,972,,,972030000N0097,,,,,,,,,,,,,0,1,Maison,65,4,S,sols,,,321,-61.109869,14.8653
2021-1668120,2021-08-23,000001,Vente,120000,5177,,HACKAERT NORD,B044,97218,97203,Basse-Pointe,972,,,972030000B0177,,,,,,,,,,,,,0,1,Maison,20,2,S,sols,,,921,-61.122793,14.868373
2021-1668120,2021-08-23,000001,Vente,120000,,,HACKAERT NORD,B044,97218,97203,Basse-Pointe,972,,,972030000B0500,,,,,,,,,,,,,0,,,,,S,sols,,,111,-61.12284,14.868223
2021-1668120,2021-08-23,000001,Vente,120000,,,HACKAERT NORD,B044,97218,97203,Basse-Pointe,972,,,972030000B0745,,,,,,,,,,,,,0,,,,,S,sols,,,210,-61.122714,14.868292
2021-1668399,2021-10-01,000001,Vente,110000,5030,F,VC DITE DE HAUTEURS BOURDON,0019,97218,97203,Basse-Pointe,972,,,972030000L0030,,,,,,,,,,,,,0,,,,,T,terres,,,2065,-61.139445,14.846245
2021-1668472,2021-10-14,000001,Vente,15000,,,VC DITE DE MORNE BALAI,0037,97218,97203,Basse-Pointe,972,,,972030000I0233,,,,,,,,,,,,,0,,,,,T,terres,,,2775,-61.130885,14.830886
2021-1668968,2021-11-17,000001,Vente,105000,4,,RUE EMILE RAMIN,0016,97218,97203,Basse-Pointe,972,,,972030000B0670,,,,,,,,,,,,,0,1,Maison,136,5,S,sols,,,316,-61.121172,14.869438
2021-1669064,2021-12-01,000001,Vente,180000,22,,LOT LES MOUBINS,A036,97218,97203,Basse-Pointe,972,,,972030000B0544,,,,,,,,,,,,,0,1,Maison,100,4,S,sols,,,589,-61.126529,14.867149
