id_mutation,date_mutation,numero_disposition,nature_mutation,valeur_fonciere,adresse_numero,adresse_suffixe,adresse_nom_voie,adresse_code_voie,code_postal,code_commune,nom_commune,code_departement,ancien_code_commune,ancien_nom_commune,id_parcelle,ancien_id_parcelle,numero_volume,lot1_numero,lot1_surface_carrez,lot2_numero,lot2_surface_carrez,lot3_numero,lot3_surface_carrez,lot4_numero,lot4_surface_carrez,lot5_numero,lot5_surface_carrez,nombre_lots,code_type_local,type_local,surface_reelle_bati,nombre_pieces_principales,code_nature_culture,nature_culture,code_nature_culture_speciale,nature_culture_speciale,surface_terrain,longitude,latitude
2021-1666427,2021-02-04,000001,Vente,170000,5671,F,MORNE HONORE,B260,97211,97220,Rivière-Pilote,972,,,972200000L0671,,,,,,,,,,,,,0,1,Maison,80,3,S,sols,,,920,-60.924832,14.517552
2021-1666636,2021-03-09,000001,Vente,240000,5243,F,BEAUDELLE,B020,97211,97220,Rivière-Pilote,972,,,972200000K0680,,,,,,,,,,,,,0,1,Maison,68,4,S,sols,,,729,-60.909948,14.521931
2021-1666688,2021-03-26,000001,Vente,4000,,,WENT NORD,B376,97211,97220,Rivière-Pilote,972,,,972200000P0443,,,,,,,,,,,,,0,,,,,S,sols,,,374,-60.892398,14.538681
2021-1666786,2021-03-29,000001,Vente,170000,5375,,RUE DES RESISTANTS CARAIBES,0655,97211,97220,Rivière-Pilote,972,,,972200000A0908,,,,,,,,,,,,,0,1,Maison,104,5,S,sols,,,65,-60.903992,14.487238
2021-1666786,2021-03-29,000001,Vente,170000,,,RUE DES RESISTANTS CARAIBES,0655,97211,97220,Rivière-Pilote,972,,,972200000A0909,,,,,,,,,,,,,0,,,,,S,sols,,,23,-60.903989,14.487283
2021-1667051,2021-05-17,000001,Vente,130000,,,JOSSEAUD,B180,97211,97220,Rivière-Pilote,972,,,972200000T0796,,,,,,,,,,,,,0,,,,,AB,terrains a bâtir,,,1732,-60.886513,14.526027
2021-1667060,2021-04-30,000001,Vente,32400,,,MORNE HONORE,B260,97211,97220,Rivière-Pilote,972,,,972200000L0940,,,,,,,,,,,,,0,,,,,T,terres,,,490,-60.922842,14.522309
2021-1667360,2021-05-25,000001,Vente,180000,5621,F,MORNE HONORE,B260,97211,97220,Rivière-Pilote,972,,,972200000L0621,,,,,,,,,,,,,0,1,Maison,77,3,T,terres,,,1513,-60.922295,14.51989
2021-1667360,2021-05-25,000001,Vente,180000,5621,F,MORNE HONORE,B260,97211,97220,Rivière-Pilote,972,,,972200000L0621,,,,,,,,,,,,,0,1,Maison,77,3,S,sols,,,500,-60.922295,14.51989
2021-1667390,2021-06-03,000001,Vente,282500,5221,,JOSSEAUD,B180,97211,97220,Rivière-Pilote,972,,,972200000T0221,,,,,,,,,,,,,0,1,Maison,98,4,T,terres,,,8396,-60.880819,14.524566
2021-1667390,2021-06-03,000001,Vente,282500,5221,,JOSSEAUD,B180,97211,97220,Rivière-Pilote,972,,,972200000T0221,,,,,,,,,,,,,0,1,Maison,98,4,S,sols,,,1344,-60.880819,14.524566
2021-1667390,2021-06-03,000001,Vente,282500,5221,,JOSSEAUD,B180,97211,97220,Rivière-Pilote,972,,,972200000T0221,,,,,,,,,,,,,0,2,Appartement,10,1,S,sols,,,1344,-60.880819,14.524566
2021-1667390,2021-06-03,000001,Vente,282500,5221,,JOSSEAUD,B180,97211,97220,Rivière-Pilote,972,,,972200000T0221,,,,,,,,,,,,,0,2,Appartement,10,1,T,terres,,,8396,-60.880819,14.524566
2021-1667433,2021-06-23,000001,Vente,4000,,,L ESCOET SUD,B187,97211,97220,Rivière-Pilote,972,,,97220000AI0149,,,,,,,,,,,,,0,,,,,BT,taillis simples,,,2682,-60.894044,14.493698
2021-1667448,2021-06-02,000001,Vente,240000,5650,F,MORNE HONORE,B260,97211,97220,Rivière-Pilote,972,,,972200000L0718,,,,,,,,,,,,,0,1,Maison,82,4,J,jardins,,,1203,-60.917969,14.518605
2021-1667448,2021-06-02,000001,Vente,240000,5650,F,MORNE HONORE,B260,97211,97220,Rivière-Pilote,972,,,972200000L0718,,,,,,,,,,,,,0,1,Maison,82,4,S,sols,,,500,-60.917969,14.518605
2021-1667562,2021-06-22,000001,Vente,13300,,,POMPONNE,B295,97211,97220,Rivière-Pilote,972,,,972200000A1047,,,,,,,,,,,,,0,,,,,AB,terrains a bâtir,,,333,-60.905266,14.484284
2021-1667809,2021-07-29,000001,Vente,220000,5433,F,JOSSEAUD,B180,97211,97220,Rivière-Pilote,972,,,972200000T0786,,,,,,,,,,,,,0,1,Maison,155,5,S,sols,,,1000,-60.883807,14.528544
2021-1667851,2021-07-30,000001,Vente,275000,5329,F,VIEILLE TERRE,B365,97211,97220,Rivière-Pilote,972,,,972200000P0329,,,,,,,,,,,,,0,1,Maison,160,5,T,terres,,,3159,-60.891421,14.546267
2021-1667926,2021-08-04,000001,Vente,1000,,,CR DE BELLAY,0121,97211,97220,Rivière-Pilote,972,,,972200000V0343,,,,,,,,,,,,,0,,,,,T,terres,,,275,-60.89535,14.524923
2021-1667956,2021-08-02,000001,Vente,175000,,,RES MANIKOU 2  DESFARGES,A051,97211,97220,Rivière-Pilote,972,,,97220000AL0389,,,,,,,,,,,,,0,,,,,AB,terrains a bâtir,,,2174,-60.905829,14.481214
2021-1668071,2021-08-31,000001,Vente,120000,5082,,VC DE MORNE ESCARPE,0441,97211,97220,Rivière-Pilote,972,,,972200000X0247,,,,,,,,,,,,,0,1,Maison,34,3,S,sols,,,39,-60.903477,14.518268
2021-1668071,2021-08-31,000001,Vente,120000,5082,,VC DE MORNE ESCARPE,0441,97211,97220,Rivière-Pilote,972,,,972200000X0247,,,,,,,,,,,,,0,1,Maison,34,3,T,terres,,,7171,-60.903477,14.518268
2021-1668256,2021-09-23,000001,Vente,1500,5660,F,PREFONTAINE EST,B313,97211,97220,Rivière-Pilote,972,,,972200000K0660,,,,,,,,,,,,,0,1,Maison,30,2,AG,terrains d'agrément,,,2000,-60.908089,14.509798
2021-1668256,2021-09-23,000001,Vente,1500,5660,F,PREFONTAINE EST,B313,97211,97220,Rivière-Pilote,972,,,972200000K0660,,,,,,,,,,,,,0,1,Maison,30,2,S,sols,,,606,-60.908089,14.509798
2021-1668290,2021-09-07,000001,Vente,440120,5334,F,PONT MADELEINE,B305,97211,97220,Rivière-Pilote,972,,,972200000E0334,,,,,,,,,,,,,0,1,Maison,102,3,AB,terrains a bâtir,,,720,-60.90406,14.497891
2021-1668451,2021-09-24,000001,Vente,3000,,,REGALE EST,B333,97211,97220,Rivière-Pilote,972,,,972200000O0328,,,,,,,,,,,,,0,,,,,T,terres,,,1904,-60.90959,14.533079
2021-1668550,2021-10-06,000001,Vente,2000,,,DESFARGES,B115,97211,97220,Rivière-Pilote,972,,,97220000AI0670,,,,,,,,,,,,,0,,,,,BT,taillis simples,,,4810,-60.902389,14.478805
2021-1668550,2021-10-06,000001,Vente,2000,,,DESFARGES,B115,97211,97220,Rivière-Pilote,972,,,97220000AI0670,,,,,,,,,,,,,0,,,,,P,prés,,,1200,-60.902389,14.478805
2021-1668704,2021-10-22,000002,Vente,21350,5519,F,REGALE,B330,97211,97220,Rivière-Pilote,972,,,972200000N0972,,,,,,,,,,,,,0,1,Maison,131,5,T,terres,,,715,-60.925499,14.531535
2021-1668787,2021-11-19,000001,Vente,245000,5620,F,REGALE,B330,97211,97220,Rivière-Pilote,972,,,972200000N0620,,,,,,,,,,,,,0,2,Appartement,45,2,S,sols,,,844,-60.921704,14.530843
2021-1668787,2021-11-19,000001,Vente,245000,5620,F,REGALE,B330,97211,97220,Rivière-Pilote,972,,,972200000N0620,,,,,,,,,,,,,0,2,Appartement,80,3,S,sols,,,844,-60.921704,14.530843
2021-1668787,2021-11-19,000001,Vente,245000,5620,F,REGALE,B330,97211,97220,Rivière-Pilote,972,,,972200000N0620,,,,,,,,,,,,,0,2,Appartement,45,2,S,sols,,,844,-60.921704,14.530843
2021-1668801,2021-10-18,000001,Vente,140000,5369,,RUE DES RESISTANTS CARAIBES,0655,97211,97220,Rivière-Pilote,972,,,972200000A0369,,,,,,,,,,,,,0,1,Maison,72,4,S,sols,,,47,-60.903842,14.487406
2021-1668821,2021-10-11,000001,Vente,4400,,,DESFARGES,B115,97211,97220,Rivière-Pilote,972,,,97220000AI0496,,,,,,,,,,,,,0,,,,,T,terres,,,5375,-60.89451,14.490723
2021-1668821,2021-10-11,000001,Vente,4400,,,DESFARGES,B115,97211,97220,Rivière-Pilote,972,,,97220000AI0496,,,,,,,,,,,,,0,,,,,BT,taillis simples,,,9390,-60.89451,14.490723
2021-1668838,2021-11-20,000001,Vente,194543,5260,F,JOSSEAUD,B180,97211,97220,Rivière-Pilote,972,,,972200000V0260,,,,,,,,,,,,,0,2,Appartement,121,4,S,sols,,,927,-60.894677,14.528775
2021-1668838,2021-11-20,000001,Vente,194543,5260,F,JOSSEAUD,B180,97211,97220,Rivière-Pilote,972,,,972200000V0260,,,,,,,,,,,,,0,2,Appartement,63,2,S,sols,,,927,-60.894677,14.528775
2021-1668838,2021-11-20,000001,Vente,194543,,,BELLAY,B050,97211,97220,Rivière-Pilote,972,,,972200000V0261,,,,,,,,,,,,,0,,,,,T,terres,,,1223,-60.894442,14.528797
2021-1668948,2021-12-07,000001,Vente,5000,,,REGALE,B330,97211,97220,Rivière-Pilote,972,,,972200000N0907,,,,,,,,,,,,,0,,,,,S,sols,,,210,-60.915176,14.535809
2021-1668948,2021-12-07,000001,Vente,5000,,,REGALE,B330,97211,97220,Rivière-Pilote,972,,,972200000N0909,,,,,,,,,,,,,0,,,,,T,terres,,,2700,-60.915097,14.535499
2021-1669055,2021-12-02,000001,Vente,378000,5198,F,ESCARVAILLE,B140,97211,97220,Rivière-Pilote,972,,,97220000AB0198,,,,,,,,,,,,,0,2,Appartement,60,2,S,sols,,,595,-60.87189,14.511562
2021-1669055,2021-12-02,000001,Vente,378000,5198,F,ESCARVAILLE,B140,97211,97220,Rivière-Pilote,972,,,97220000AB0198,,,,,,,,,,,,,0,2,Appartement,114,4,AG,terrains d'agrément,,,2800,-60.87189,14.511562
2021-1669055,2021-12-02,000001,Vente,378000,5198,F,ESCARVAILLE,B140,97211,97220,Rivière-Pilote,972,,,97220000AB0198,,,,,,,,,,,,,0,2,Appartement,60,2,AG,terrains d'agrément,,,2800,-60.87189,14.511562
2021-1669055,2021-12-02,000001,Vente,378000,5198,F,ESCARVAILLE,B140,97211,97220,Rivière-Pilote,972,,,97220000AB0198,,,,,,,,,,,,,0,3,Dépendance,,0,AG,terrains d'agrément,,,2800,-60.87189,14.511562
2021-1669055,2021-12-02,000001,Vente,378000,5198,F,ESCARVAILLE,B140,97211,97220,Rivière-Pilote,972,,,97220000AB0198,,,,,,,,,,,,,0,3,Dépendance,,0,AG,terrains d'agrément,,,2800,-60.87189,14.511562
2021-1669055,2021-12-02,000001,Vente,378000,5198,F,ESCARVAILLE,B140,97211,97220,Rivière-Pilote,972,,,97220000AB0198,,,,,,,,,,,,,0,2,Appartement,114,4,S,sols,,,595,-60.87189,14.511562
2021-1669055,2021-12-02,000001,Vente,378000,5198,F,ESCARVAILLE,B140,97211,97220,Rivière-Pilote,972,,,97220000AB0198,,,,,,,,,,,,,0,3,Dépendance,,0,S,sols,,,595,-60.87189,14.511562
2021-1669055,2021-12-02,000001,Vente,378000,5198,F,ESCARVAILLE,B140,97211,97220,Rivière-Pilote,972,,,97220000AB0198,,,,,,,,,,,,,0,3,Dépendance,,0,S,sols,,,595,-60.87189,14.511562
2021-1669065,2021-12-10,000001,Vente,40000,,,VC DE PERRINE,0497,97211,97220,Rivière-Pilote,972,,,972200000W0509,,,,,,,,,,,,,0,,,,,T,terres,,,475,-60.905451,14.525804
2021-1669145,2021-12-17,000001,Vente,27000,,,VC DE SAINT VINCENT,0682,97211,97220,Rivière-Pilote,972,,,97220000AC0774,,,,,,,,,,,,,0,,,,,T,terres,,,365,-60.879312,14.503775
2021-1669182,2021-12-10,000001,Vente,299000,5244,F,CR DE PREFONTAINE,0561,97211,97220,Rivière-Pilote,972,,,972200000I0244,,,,,,,,,,,,,0,1,Maison,108,4,S,sols,,,500,-60.920378,14.512895
2021-1669204,2021-12-23,000001,Vente,841,,,REGALE,B330,97211,97220,Rivière-Pilote,972,,,972200000N0465,,,,,,,,,,,,,0,,,,,T,terres,,,4207,-60.915125,14.529431
2021-1669221,2021-12-30,000001,Vente,130000,5701,F,REGALE,B330,97211,97220,Rivière-Pilote,972,,,972200000N0701,,,,,,,,,,,,,0,1,Maison,110,3,S,sols,,,740,-60.919813,14.526459
2021-1669221,2021-12-30,000001,Vente,130000,,,REGALE,B330,97211,97220,Rivière-Pilote,972,,,972200000N0702,,,,,,,,,,,,,0,,,,,T,terres,,,740,-60.919835,14.52637
2021-1669458,2021-10-12,000001,Adjudication,31000,5328,F,RUE DU MARRONNAGE,0372,97211,97220,Rivière-Pilote,972,,,972200000A0328,,,,,,,,,,,,,0,4,Local industriel. commercial ou assimilé,25,0,S,sols,,,42,-60.903152,14.487397
2021-1669458,2021-10-12,000001,Adjudication,31000,5328,F,RUE DU MARRONNAGE,0372,97211,97220,Rivière-Pilote,972,,,972200000A0328,,,,,,,,,,,,,0,4,Local industriel. commercial ou assimilé,25,0,S,sols,,,42,-60.903152,14.487397
2021-1669468,2021-10-12,000001,Adjudication,31000,5328,F,RUE DU MARRONNAGE,0372,97211,97220,Rivière-Pilote,972,,,972200000A0328,,,,,,,,,,,,,0,4,Local industriel. commercial ou assimilé,25,0,S,sols,,,42,-60.903152,14.487397
2021-1669468,2021-10-12,000001,Adjudication,31000,5328,F,RUE DU MARRONNAGE,0372,97211,97220,Rivière-Pilote,972,,,972200000A0328,,,,,,,,,,,,,0,4,Local industriel. commercial ou assimilé,25,0,S,sols,,,42,-60.903152,14.487397
