id_mutation,date_mutation,numero_disposition,nature_mutation,valeur_fonciere,adresse_numero,adresse_suffixe,adresse_nom_voie,adresse_code_voie,code_postal,code_commune,nom_commune,code_departement,ancien_code_commune,ancien_nom_commune,id_parcelle,ancien_id_parcelle,numero_volume,lot1_numero,lot1_surface_carrez,lot2_numero,lot2_surface_carrez,lot3_numero,lot3_surface_carrez,lot4_numero,lot4_surface_carrez,lot5_numero,lot5_surface_carrez,nombre_lots,code_type_local,type_local,surface_reelle_bati,nombre_pieces_principales,code_nature_culture,nature_culture,code_nature_culture_speciale,nature_culture_speciale,surface_terrain,longitude,latitude
2023-981,2023-01-30,000001,Vente,260000,5389,,PERROZET,B041,01300,01058,Brégnier-Cordon,01,,,010580000A2702,,,,,,,,,,,,,0,1,Maison,90,4,S,sols,,,1044,5.619563,45.65124
2023-981,2023-01-30,000001,Vente,260000,,,PERROZET,B041,01300,01058,Brégnier-Cordon,01,,,010580000A2705,,,,,,,,,,,,,0,,,,,S,sols,,,259,5.619716,45.651479
2023-981,2023-01-30,000001,Vente,260000,,,PERROZET,B041,01300,01058,Brégnier-Cordon,01,,,010580000A2706,,,,,,,,,,,,,0,,,,,S,sols,,,55,5.619515,45.651679
2023-4058,2023-04-17,000001,Vente,8200,,,COURS,B014,01300,01058,Brégnier-Cordon,01,,,010580000B0922,,,,,,,,,,,,,0,,,,,L,landes,PATUR,Pâture plantée,820,5.630635,45.623625
2023-4058,2023-04-17,000001,Vente,8200,,,COURS,B014,01300,01058,Brégnier-Cordon,01,,,010580000B0924,,,,,,,,,,,,,0,,,,,L,landes,FRICH,Friche,16100,5.633319,45.622255
2023-4058,2023-04-17,000001,Vente,8200,,,COURS,B014,01300,01058,Brégnier-Cordon,01,,,010580000B0925,,,,,,,,,,,,,0,,,,,T,terres,,,4360,5.633901,45.622588
2023-4058,2023-04-17,000001,Vente,8200,,,COURS,B014,01300,01058,Brégnier-Cordon,01,,,010580000B0926,,,,,,,,,,,,,0,,,,,P,prés,,,6175,5.63304,45.623067
2023-4058,2023-04-17,000001,Vente,8200,,,COURS,B014,01300,01058,Brégnier-Cordon,01,,,010580000B0927,,,,,,,,,,,,,0,,,,,BT,taillis simples,,,4220,5.633383,45.623154
2023-4058,2023-04-17,000001,Vente,8200,,,COURS,B014,01300,01058,Brégnier-Cordon,01,,,010580000B0928,,,,,,,,,,,,,0,,,,,P,prés,,,2750,5.634226,45.62311
2023-4058,2023-04-17,000001,Vente,8200,,,COURS,B014,01300,01058,Brégnier-Cordon,01,,,010580000B0931,,,,,,,,,,,,,0,,,,,T,terres,,,10110,5.632337,45.623857
2023-4058,2023-04-17,000001,Vente,8200,,,COURS,B014,01300,01058,Brégnier-Cordon,01,,,010580000B0933,,,,,,,,,,,,,0,,,,,BT,taillis simples,,,1965,5.631238,45.624023
2023-4058,2023-04-17,000001,Vente,8200,,,COURS,B014,01300,01058,Brégnier-Cordon,01,,,010580000B1132,,,,,,,,,,,,,0,,,,,L,landes,PATUR,Pâture plantée,1320,5.634541,45.621544
2023-4069,2023-04-21,000001,Vente,137000,,,GLANDIEU,B019,01300,01058,Brégnier-Cordon,01,,,010580000A1673,,,,,,,,,,,,,0,,,,,S,sols,,,76,5.613321,45.664009
2023-4069,2023-04-21,000001,Vente,137000,5287,,RUE DE LA CASCADE,0040,01300,01058,Brégnier-Cordon,01,,,010580000A1674,,,,,,,,,,,,,0,1,Maison,90,4,S,sols,,,87,5.613272,45.664116
2023-4752,2023-05-02,000001,Vente,243000,5392,,LE PORT,B051,01300,01058,Brégnier-Cordon,01,,,010580000B0780,,,,,,,,,,,,,0,3,Dépendance,,0,S,sols,,,55,5.635883,45.622141
2023-4752,2023-05-02,000001,Vente,243000,5392,,LE PORT,B051,01300,01058,Brégnier-Cordon,01,,,010580000B0780,,,,,,,,,,,,,0,3,Dépendance,,0,S,sols,,,55,5.635883,45.622141
2023-4752,2023-05-02,000001,Vente,243000,5183,,LE PORT,B051,01300,01058,Brégnier-Cordon,01,,,010580000B1347,,,,,,,,,,,,,0,3,Dépendance,,0,S,sols,,,257,5.635999,45.622074
2023-4752,2023-05-02,000001,Vente,243000,5183,,LE PORT,B051,01300,01058,Brégnier-Cordon,01,,,010580000B1347,,,,,,,,,,,,,0,3,Dépendance,,0,S,sols,,,257,5.635999,45.622074
2023-4752,2023-05-02,000001,Vente,243000,5183,,LE PORT,B051,01300,01058,Brégnier-Cordon,01,,,010580000B1347,,,,,,,,,,,,,0,1,Maison,96,5,S,sols,,,257,5.635999,45.622074
2023-4766,2023-05-11,000001,Vente,120000,,,BROTTEAUX DE CORDON,B009,01300,01058,Brégnier-Cordon,01,,,010580000B0551,,,,,,,,,,,,,0,,,,,BP,peupleraies,,,1530,5.621364,45.627894
2023-4766,2023-05-11,000001,Vente,120000,,,BROTTEAUX DE CORDON,B009,01300,01058,Brégnier-Cordon,01,,,010580000B0552,,,,,,,,,,,,,0,,,,,L,landes,FRICH,Friche,1260,5.620837,45.628042
2023-4766,2023-05-11,000001,Vente,120000,,,BROTTEAUX DE CORDON,B009,01300,01058,Brégnier-Cordon,01,,,010580000B0553,,,,,,,,,,,,,0,,,,,T,terres,,,5445,5.621034,45.628367
2023-4766,2023-05-11,000001,Vente,120000,,,BROTTEAUX DE CORDON,B009,01300,01058,Brégnier-Cordon,01,,,010580000B0554,,,,,,,,,,,,,0,,,,,BP,peupleraies,,,1610,5.621298,45.629203
2023-4766,2023-05-11,000001,Vente,120000,,,BROTTEAUX DE CORDON,B009,01300,01058,Brégnier-Cordon,01,,,010580000B0555,,,,,,,,,,,,,0,,,,,P,prés,,,8310,5.621723,45.629159
2023-4766,2023-05-11,000001,Vente,120000,,,BROTTEAUX DE CORDON,B009,01300,01058,Brégnier-Cordon,01,,,010580000B0556,,,,,,,,,,,,,0,,,,,BT,taillis simples,,,2560,5.62197,45.629475
2023-4766,2023-05-11,000001,Vente,120000,,,BROTTEAUX DE CORDON,B009,01300,01058,Brégnier-Cordon,01,,,010580000B0557,,,,,,,,,,,,,0,,,,,L,landes,FRICH,Friche,5980,5.621953,45.629381
2023-4766,2023-05-11,000001,Vente,120000,,,BROTTEAUX DE CORDON,B009,01300,01058,Brégnier-Cordon,01,,,010580000B0558,,,,,,,,,,,,,0,,,,,BT,taillis simples,,,1785,5.622205,45.628376
2023-4766,2023-05-11,000001,Vente,120000,,,BROTTEAUX DE CORDON,B009,01300,01058,Brégnier-Cordon,01,,,010580000B0559,,,,,,,,,,,,,0,,,,,P,prés,,,8700,5.622451,45.628301
2023-4766,2023-05-11,000001,Vente,120000,,,BROTTEAUX DE CORDON,B009,01300,01058,Brégnier-Cordon,01,,,010580000B0560,,,,,,,,,,,,,0,,,,,T,terres,,,3725,5.622309,45.62746
2023-4766,2023-05-11,000001,Vente,120000,,,BROTTEAUX DE CORDON,B009,01300,01058,Brégnier-Cordon,01,,,010580000B0610,,,,,,,,,,,,,0,,,,,BT,taillis simples,,,1810,5.62071,45.630796
2023-4766,2023-05-11,000001,Vente,120000,,,BROTTEAUX DE CORDON,B009,01300,01058,Brégnier-Cordon,01,,,010580000B0613,,,,,,,,,,,,,0,,,,,L,landes,FRICH,Friche,2000,5.620644,45.631244
2023-4766,2023-05-11,000001,Vente,120000,,,BROTTEAUX DE CORDON,B009,01300,01058,Brégnier-Cordon,01,,,010580000B0618,,,,,,,,,,,,,0,,,,,P,prés,,,65,5.620709,45.632449
2023-4766,2023-05-11,000001,Vente,120000,,,BROTTEAUX DE CORDON,B009,01300,01058,Brégnier-Cordon,01,,,010580000B1592,,,,,,,,,,,,,0,,,,,BT,taillis simples,,,10322,5.622446,45.629673
2023-4766,2023-05-11,000001,Vente,120000,,,BROTTEAUX DE CORDON,B009,01300,01058,Brégnier-Cordon,01,,,010580000B1595,,,,,,,,,,,,,0,,,,,L,landes,PATUR,Pâture plantée,1180,5.621305,45.631311
2023-4766,2023-05-11,000001,Vente,120000,,,BROTTEAUX DE CORDON,B009,01300,01058,Brégnier-Cordon,01,,,010580000B1597,,,,,,,,,,,,,0,,,,,L,landes,PATUR,Pâture plantée,9231,5.621076,45.63102
2023-5536,2023-06-01,000001,Vente,1000,,,BREGNIER VILLAGE,B006,01300,01058,Brégnier-Cordon,01,,,010580000A2639,,,,,,,,,,,,,0,,,,,T,terres,,,1352,5.617687,45.64825
2023-5660,2023-05-03,000001,Vente,288350,5397,,MTE DE LA BARRE,0015,01300,01058,Brégnier-Cordon,01,,,010580000B0251,,,,,,,,,,,,,0,1,Maison,179,8,S,sols,,,1000,5.622202,45.632981
2023-5660,2023-05-03,000001,Vente,288350,5397,,MTE DE LA BARRE,0015,01300,01058,Brégnier-Cordon,01,,,010580000B0251,,,,,,,,,,,,,0,1,Maison,179,8,J,jardins,,,1350,5.622202,45.632981
2023-5660,2023-05-03,000001,Vente,288350,5397,,MTE DE LA BARRE,0015,01300,01058,Brégnier-Cordon,01,,,010580000B0251,,,,,,,,,,,,,0,3,Dépendance,,0,J,jardins,,,1350,5.622202,45.632981
2023-5660,2023-05-03,000001,Vente,288350,5397,,MTE DE LA BARRE,0015,01300,01058,Brégnier-Cordon,01,,,010580000B0251,,,,,,,,,,,,,0,3,Dépendance,,0,S,sols,,,1000,5.622202,45.632981
2023-6711,2023-06-15,000001,Vente,360000,,,GLANDIEU,B019,01300,01058,Brégnier-Cordon,01,,,010580000A1453,,,,,,,,,,,,,0,,,,,S,sols,,,312,5.612231,45.664604
2023-6711,2023-06-15,000001,Vente,360000,,,GLANDIEU,B019,01300,01058,Brégnier-Cordon,01,,,010580000A1723,,,,,,,,,,,,,0,,,,,J,jardins,,,1137,5.612505,45.664355
2023-6711,2023-06-15,000001,Vente,360000,5334,,GLANDIEU,B019,01300,01058,Brégnier-Cordon,01,,,010580000A1726,,,,,,,,,,,,,0,1,Maison,140,5,S,sols,,,705,5.612509,45.664451
2023-6711,2023-06-15,000001,Vente,360000,,,GLANDIEU,B019,01300,01058,Brégnier-Cordon,01,,,010580000A2451,,,,,,,,,,,,,0,,,,,T,terres,,,81,5.612037,45.664543
2023-6832,2023-06-09,000001,Vente,5000,,,LA BARRE,B001,01300,01058,Brégnier-Cordon,01,,,010580000B0292,,,,,,,,,,,,,0,,,,,L,landes,PATUR,Pâture plantée,560,5.625268,45.628225
2023-6832,2023-06-09,000001,Vente,5000,,,LA BARRE,B001,01300,01058,Brégnier-Cordon,01,,,010580000B1985,,,,,,,,,,,,,0,,,,,L,landes,PATUR,Pâture plantée,4002,5.624848,45.628609
2023-6832,2023-06-09,000001,Vente,5000,,,LA BARRE,B001,01300,01058,Brégnier-Cordon,01,,,010580000B1987,,,,,,,,,,,,,0,,,,,P,prés,,,3213,5.625149,45.627951
2023-6832,2023-06-09,000001,Vente,5000,,,LA BARRE,B001,01300,01058,Brégnier-Cordon,01,,,010580000B1989,,,,,,,,,,,,,0,,,,,T,terres,,,3068,5.624904,45.627593
2023-7479,2023-07-13,000003,Vente,64000,,,LA BRUYERE,B010,01300,01058,Brégnier-Cordon,01,,,010580000A2966,,,,,,,,,,,,,0,,,,,S,sols,,,29,5.62902,45.641208
2023-8966,2023-08-02,000001,Vente,2624,,,LE GRAND CLOS,B022,01300,01058,Brégnier-Cordon,01,,,010580000A1162,,,,,,,,,,,,,0,,,,,L,landes,FRICH,Friche,1182,5.614049,45.659967
2023-9914,2023-08-22,000001,Vente,170000,753,,RUE DE LA CASCADE,0040,01300,01058,Brégnier-Cordon,01,,,010580000A2516,,,,,,,,,,,,,0,1,Maison,110,6,S,sols,,,377,5.613955,45.663272
2023-9962,2023-09-06,000001,Vente,1500,,,LES BROTTEAUX,B008,01300,01058,Brégnier-Cordon,01,,,010580000A0744,,,,,,,,,,,,,0,,,,,BP,peupleraies,,,2400,5.611357,45.653347
2023-9962,2023-09-06,000001,Vente,1500,,,LES BROTTEAUX,B008,01300,01058,Brégnier-Cordon,01,,,010580000A1769,,,,,,,,,,,,,0,,,,,BP,peupleraies,,,3571,5.610342,45.654557
2023-10000,2023-09-06,000001,Echange,276,,,LE GRAND CLOS,B022,01300,01058,Brégnier-Cordon,01,,,010580000A1183,,,,,,,,,,,,,0,,,,,L,landes,PATUR,Pâture plantée,2760,5.61215,45.658379
2023-10000,2023-09-06,000002,Echange,276,,,LE GRAND CLOS,B022,01300,01058,Brégnier-Cordon,01,,,010580000A1478,,,,,,,,,,,,,0,,,,,L,landes,PATUR,Pâture plantée,903,5.612316,45.658017
2023-10000,2023-09-06,000002,Echange,276,,,LE GRAND CLOS,B022,01300,01058,Brégnier-Cordon,01,,,010580000A1479,,,,,,,,,,,,,0,,,,,L,landes,PATUR,Pâture plantée,903,5.612061,45.658021
2023-10000,2023-09-06,000002,Echange,276,,,LE GRAND CLOS,B022,01300,01058,Brégnier-Cordon,01,,,010580000A1480,,,,,,,,,,,,,0,,,,,L,landes,PATUR,Pâture plantée,902,5.612165,45.658122
2023-10329,2023-09-18,000001,Vente,149500,412,,RUE DE LA CASCADE,0040,01300,01058,Brégnier-Cordon,01,,,010580000A1334,,,,,,,,,,,,,0,3,Dépendance,,0,S,sols,,,319,5.615175,45.660527
2023-10329,2023-09-18,000001,Vente,149500,412,,RUE DE LA CASCADE,0040,01300,01058,Brégnier-Cordon,01,,,010580000A1334,,,,,,,,,,,,,0,3,Dépendance,,0,S,sols,,,319,5.615175,45.660527
2023-10329,2023-09-18,000001,Vente,149500,412,,RUE DE LA CASCADE,0040,01300,01058,Brégnier-Cordon,01,,,010580000A1334,,,,,,,,,,,,,0,2,Appartement,213,7,S,sols,,,319,5.615175,45.660527
2023-10329,2023-09-18,000001,Vente,149500,412,,RUE DE LA CASCADE,0040,01300,01058,Brégnier-Cordon,01,,,010580000A1334,,,,,,,,,,,,,0,2,Appartement,112,6,S,sols,,,319,5.615175,45.660527
2023-10329,2023-09-18,000001,Vente,149500,412,,RUE DE LA CASCADE,0040,01300,01058,Brégnier-Cordon,01,,,010580000A1334,,,,,,,,,,,,,0,3,Dépendance,,0,S,sols,,,319,5.615175,45.660527
2023-10330,2023-09-25,000001,Vente,3300,,,LE GAZ,B018,01300,01058,Brégnier-Cordon,01,,,010580000A0353,,,,,,,,,,,,,0,,,,,BT,taillis simples,,,260,5.614949,45.648886
2023-10330,2023-09-25,000001,Vente,3300,,,L ILON,B033,01300,01058,Brégnier-Cordon,01,,,010580000A0613,,,,,,,,,,,,,0,,,,,BT,taillis simples,,,1300,5.612408,45.648903
2023-10330,2023-09-25,000001,Vente,3300,,,PERROZET,B041,01300,01058,Brégnier-Cordon,01,,,010580000A0960,,,,,,,,,,,,,0,,,,,BT,taillis simples,,,630,5.621147,45.650931
2023-10330,2023-09-25,000001,Vente,3300,,,POMMARET,B049,01300,01058,Brégnier-Cordon,01,,,010580000A1140,,,,,,,,,,,,,0,,,,,BT,taillis simples,,,2425,5.615658,45.6492
2023-10330,2023-09-25,000001,Vente,3300,,,POMMARET,B049,01300,01058,Brégnier-Cordon,01,,,010580000A1141,,,,,,,,,,,,,0,,,,,P,prés,,,650,5.615655,45.649603
2023-10330,2023-09-25,000001,Vente,3300,,,POMMARET,B049,01300,01058,Brégnier-Cordon,01,,,010580000A1142,,,,,,,,,,,,,0,,,,,BT,taillis simples,,,95,5.615954,45.650115
2023-10330,2023-09-25,000001,Vente,3300,,,POMMARET,B049,01300,01058,Brégnier-Cordon,01,,,010580000A1145,,,,,,,,,,,,,0,,,,,L,landes,FRICH,Friche,75,5.615848,45.650168
2023-10330,2023-09-25,000001,Vente,3300,,,POMMARET,B049,01300,01058,Brégnier-Cordon,01,,,010580000A1146,,,,,,,,,,,,,0,,,,,L,landes,FRICH,Friche,815,5.615606,45.649677
2023-10330,2023-09-25,000001,Vente,3300,,,L ILON,B033,01300,01058,Brégnier-Cordon,01,,,010580000A1889,,,,,,,,,,,,,0,,,,,BT,taillis simples,,,246,5.611299,45.648697
2023-10330,2023-09-25,000001,Vente,3300,,,L ILON,B033,01300,01058,Brégnier-Cordon,01,,,010580000A1890,,,,,,,,,,,,,0,,,,,T,terres,,,2334,5.611474,45.648045
2023-10330,2023-09-25,000001,Vente,3300,,,LE GOLET,B020,01300,01058,Brégnier-Cordon,01,,,010580000A1896,,,,,,,,,,,,,0,,,,,BT,taillis simples,,,1061,5.61837,45.655478
2023-10330,2023-09-25,000001,Vente,3300,,,LE GOLET,B020,01300,01058,Brégnier-Cordon,01,,,010580000A1898,,,,,,,,,,,,,0,,,,,BT,taillis simples,,,1055,5.618596,45.655353
2023-10330,2023-09-25,000001,Vente,3300,,,LE GAZ,B018,01300,01058,Brégnier-Cordon,01,,,010580000A1966,,,,,,,,,,,,,0,,,,,P,prés,,,699,5.615405,45.649063
2023-10330,2023-09-25,000001,Vente,3300,,,LE GAZ,B018,01300,01058,Brégnier-Cordon,01,,,010580000A1967,,,,,,,,,,,,,0,,,,,P,prés,,,1833,5.615551,45.648464
2023-11444,2023-10-10,000001,Vente,183000,29,,CHE DU GRANDCHAMP,0090,01300,01058,Brégnier-Cordon,01,,,010580000B0994,,,,,,,,,,,,,0,1,Maison,92,3,S,sols,,,120,5.62984,45.625704
2023-11444,2023-10-10,000001,Vente,183000,,,CORDON,B012,01300,01058,Brégnier-Cordon,01,,,010580000B1326,,,,,,,,,,,,,0,,,,,P,prés,,,300,5.630634,45.626197
2023-11843,2023-10-20,000001,Vente,149000,,,GLANDIEU,B019,01300,01058,Brégnier-Cordon,01,,,010580000A1673,,,,,,,,,,,,,0,,,,,S,sols,,,76,5.613321,45.664009
2023-11843,2023-10-20,000001,Vente,149000,849,,RUE DE LA CASCADE,0040,01300,01058,Brégnier-Cordon,01,,,010580000A1675,,,,,,,,,,,,,0,1,Maison,78,3,S,sols,,,195,5.613367,45.663933
2023-11843,2023-10-20,000001,Vente,149000,,,GLANDIEU,B019,01300,01058,Brégnier-Cordon,01,,,010580000A1677,,,,,,,,,,,,,0,,,,,S,sols,,,127,5.613261,45.663837
2023-11844,2023-10-24,000001,Vente,200000,,,PERROZET,B041,01300,01058,Brégnier-Cordon,01,,,010580000A2743,,,,,,,,,,,,,0,,,,,AB,terrains a bâtir,,,787,5.619136,45.651953
2023-11844,2023-10-24,000001,Vente,200000,,,PERROZET,B041,01300,01058,Brégnier-Cordon,01,,,010580000A2746,,,,,,,,,,,,,0,,,,,AB,terrains a bâtir,,,417,5.618886,45.65202
2023-12205,2023-11-03,000001,Vente,270000,439,,CHE DES ECUYERS,0070,01300,01058,Brégnier-Cordon,01,,,010580000B0362,,,,,,,,,,,,,0,1,Maison,102,4,S,sols,,,475,5.627215,45.624476
2023-12205,2023-11-03,000001,Vente,270000,,,CORDON,B012,01300,01058,Brégnier-Cordon,01,,,010580000B1952,,,,,,,,,,,,,0,,,,,T,terres,,,48,5.627125,45.624671
2023-12205,2023-11-03,000001,Vente,270000,,,CORDON,B012,01300,01058,Brégnier-Cordon,01,,,010580000B1958,,,,,,,,,,,,,0,,,,,T,terres,,,619,5.627346,45.624614
2023-12269,2023-06-30,000001,Vente,425000,343,,RUE DE LA MAIRIE,0120,01300,01058,Brégnier-Cordon,01,,,010580000A1556,,,,,,,,,,,,,0,1,Maison,147,6,S,sols,,,1071,5.62267,45.643547
2023-13437,2023-12-11,000001,Vente,160000,35,,RUE DU CHATEAU,0050,01300,01058,Brégnier-Cordon,01,,,010580000B0954,,,,,,,,,,,,,0,1,Maison,63,3,S,sols,,,1300,5.62971,45.62516
