id_mutation,date_mutation,numero_disposition,nature_mutation,valeur_fonciere,adresse_numero,adresse_suffixe,adresse_nom_voie,adresse_code_voie,code_postal,code_commune,nom_commune,code_departement,ancien_code_commune,ancien_nom_commune,id_parcelle,ancien_id_parcelle,numero_volume,lot1_numero,lot1_surface_carrez,lot2_numero,lot2_surface_carrez,lot3_numero,lot3_surface_carrez,lot4_numero,lot4_surface_carrez,lot5_numero,lot5_surface_carrez,nombre_lots,code_type_local,type_local,surface_reelle_bati,nombre_pieces_principales,code_nature_culture,nature_culture,code_nature_culture_speciale,nature_culture_speciale,surface_terrain,longitude,latitude
2023-543,2023-01-31,000001,Vente,50000,,,ETANG PENET,B033,01560,01128,Courtes,01,,,01128000WA0075,,,,,,,,,,,,,0,,,,,P,prés,,,7568,5.105269,46.467024
2023-3932,2023-04-21,000001,Vente,194000,387,,RTE DE VERNOUX,0150,01560,01128,Courtes,01,,,01128000WA0186,,,,,,,,,,,,,0,3,Dépendance,,0,AG,terrains d'agrément,,,932,5.102688,46.468806
2023-3932,2023-04-21,000001,Vente,194000,387,,RTE DE VERNOUX,0150,01560,01128,Courtes,01,,,01128000WA0186,,,,,,,,,,,,,0,1,Maison,98,5,AG,terrains d'agrément,,,932,5.102688,46.468806
2023-3932,2023-04-21,000001,Vente,194000,387,,RTE DE VERNOUX,0150,01560,01128,Courtes,01,,,01128000WA0186,,,,,,,,,,,,,0,3,Dépendance,,0,S,sols,,,500,5.102688,46.468806
2023-3932,2023-04-21,000001,Vente,194000,387,,RTE DE VERNOUX,0150,01560,01128,Courtes,01,,,01128000WA0186,,,,,,,,,,,,,0,1,Maison,98,5,S,sols,,,500,5.102688,46.468806
2023-4444,2023-04-28,000002,Vente,13479.12,,,AUX LIEUX,B046,01560,01128,Courtes,01,,,01128000ZC0098,,,,,,,,,,,,,0,,,,,BT,taillis simples,,,1700,5.128239,46.443275
2023-4833,2023-04-20,000001,Vente,185000,,,LA BASSE CHANEE,B003,01560,01128,Courtes,01,,,011280000C0410,,,,,,,,,,,,,0,,,,,J,jardins,,,774,5.106297,46.451398
2023-4833,2023-04-20,000001,Vente,185000,,,LA BASSE CHANEE,B003,01560,01128,Courtes,01,,,011280000C0410,,,,,,,,,,,,,0,,,,,S,sols,,,686,5.106297,46.451398
2023-4833,2023-04-20,000001,Vente,185000,488,,RTE DE LA BASSE CHANEE,0010,01560,01128,Courtes,01,,,011280000C0411,,,,,,,,,,,,,0,1,Maison,120,2,S,sols,,,680,5.105925,46.451193
2023-4833,2023-04-20,000001,Vente,185000,488,,RTE DE LA BASSE CHANEE,0010,01560,01128,Courtes,01,,,011280000C0411,,,,,,,,,,,,,0,3,Dépendance,,0,S,sols,,,680,5.105925,46.451193
2023-4833,2023-04-20,000001,Vente,185000,,,LA BASSE CHANEE,B003,01560,01128,Courtes,01,,,011280000C0461,,,,,,,,,,,,,0,,,,,S,sols,,,23,5.105825,46.45113
2023-4833,2023-04-20,000001,Vente,185000,,,LA BASSE CHANEE,B003,01560,01128,Courtes,01,,,011280000C0462,,,,,,,,,,,,,0,,,,,S,sols,,,73,5.105961,46.451332
2023-5026,2023-04-27,000001,Vente,235000,135,,RUE DE L EGLISE,0060,01560,01128,Courtes,01,,,011280000A0104,,,,,,,,,,,,,0,1,Maison,122,4,T,terres,,,2865,5.099404,46.461087
2023-5026,2023-04-27,000001,Vente,235000,135,,RUE DE L EGLISE,0060,01560,01128,Courtes,01,,,011280000A0104,,,,,,,,,,,,,0,3,Dépendance,,0,T,terres,,,2865,5.099404,46.461087
2023-5026,2023-04-27,000001,Vente,235000,135,,RUE DE L EGLISE,0060,01560,01128,Courtes,01,,,011280000A0104,,,,,,,,,,,,,0,3,Dépendance,,0,S,sols,,,500,5.099404,46.461087
2023-5026,2023-04-27,000001,Vente,235000,135,,RUE DE L EGLISE,0060,01560,01128,Courtes,01,,,011280000A0104,,,,,,,,,,,,,0,3,Dépendance,,0,S,sols,,,500,5.099404,46.461087
2023-5026,2023-04-27,000001,Vente,235000,135,,RUE DE L EGLISE,0060,01560,01128,Courtes,01,,,011280000A0104,,,,,,,,,,,,,0,1,Maison,122,4,S,sols,,,500,5.099404,46.461087
2023-5026,2023-04-27,000001,Vente,235000,135,,RUE DE L EGLISE,0060,01560,01128,Courtes,01,,,011280000A0104,,,,,,,,,,,,,0,3,Dépendance,,0,AG,terrains d'agrément,,,2000,5.099404,46.461087
2023-5026,2023-04-27,000001,Vente,235000,135,,RUE DE L EGLISE,0060,01560,01128,Courtes,01,,,011280000A0104,,,,,,,,,,,,,0,3,Dépendance,,0,AG,terrains d'agrément,,,2000,5.099404,46.461087
2023-5026,2023-04-27,000001,Vente,235000,135,,RUE DE L EGLISE,0060,01560,01128,Courtes,01,,,011280000A0104,,,,,,,,,,,,,0,1,Maison,122,4,AG,terrains d'agrément,,,2000,5.099404,46.461087
2023-5026,2023-04-27,000001,Vente,235000,135,,RUE DE L EGLISE,0060,01560,01128,Courtes,01,,,011280000A0104,,,,,,,,,,,,,0,3,Dépendance,,0,T,terres,,,2865,5.099404,46.461087
2023-9036,2023-08-18,000001,Vente,120000,349,,RTE DE LA BASSE CHANEE,0010,01560,01128,Courtes,01,,,011280000C0106,,,,,,,,,,,,,0,1,Maison,70,3,S,sols,,,1528,5.107616,46.450974
2023-9620,2023-09-06,000002,Echange,589.94,,,LA PETITE FORET,B050,01560,01128,Courtes,01,,,011280000A0729,,,,,,,,,,,,,0,,,,,T,terres,,,2269,,
2023-9621,2023-09-06,000003,Echange,330.98,,,LA PETITE FORET,B050,01560,01128,Courtes,01,,,011280000A0726,,,,,,,,,,,,,0,,,,,T,terres,,,1273,,
2023-9859,2023-09-14,000001,Vente,345,,,AUX AYES,B001,01560,01128,Courtes,01,,,011280000C0287,,,,,,,,,,,,,0,,,,,J,jardins,,,1151,5.085559,46.456625
2023-10164,2023-09-11,000001,Vente,1200,,,L HERBEPIN,B044,01560,01128,Courtes,01,,,011280000C0301,,,,,,,,,,,,,0,,,,,T,terres,,,4200,5.089962,46.455992
2023-10164,2023-09-11,000001,Vente,1200,,,L HERBEPIN,B044,01560,01128,Courtes,01,,,011280000C0301,,,,,,,,,,,,,0,,,,,T,terres,,,4200,5.089962,46.455992
2023-12973,2023-12-13,000001,Vente,80000,,,LE BOURG,B012,01560,01128,Courtes,01,,,011280000C0490,,,,,,,,,,,,,0,,,,,P,prés,,,5008,5.098485,46.458512
