id_mutation,date_mutation,numero_disposition,nature_mutation,valeur_fonciere,adresse_numero,adresse_suffixe,adresse_nom_voie,adresse_code_voie,code_postal,code_commune,nom_commune,code_departement,ancien_code_commune,ancien_nom_commune,id_parcelle,ancien_id_parcelle,numero_volume,lot1_numero,lot1_surface_carrez,lot2_numero,lot2_surface_carrez,lot3_numero,lot3_surface_carrez,lot4_numero,lot4_surface_carrez,lot5_numero,lot5_surface_carrez,nombre_lots,code_type_local,type_local,surface_reelle_bati,nombre_pieces_principales,code_nature_culture,nature_culture,code_nature_culture_speciale,nature_culture_speciale,surface_terrain,longitude,latitude
2023-1863,2023-02-27,000002,Vente,155000,105,,IMP DE LA CROIX ROUSSE,0017,01680,01219,Lompnas,01,,,01219000AB0038,,,,,,,,,,,,,0,1,Maison,69,3,S,sols,,,595,5.52074,45.804499
2023-1863,2023-02-27,000002,Vente,155000,,,LE VILLAGE,B171,01680,01219,Lompnas,01,,,01219000AB0397,,,,,,,,,,,,,0,,,,,P,prés,,,1973,5.520789,45.804667
2023-5766,2023-05-16,000001,Vente,40000,,,LE TRAVERSIER,B167,01680,01219,Lompnas,01,,,01219000ZD0077,,,,,,,,,,,,,0,,,,,T,terres,,,8660,5.516363,45.80065
2023-7196,2023-07-10,000001,Vente,199000,65,,RTE DE MARCHAMP,0049,01680,01219,Lompnas,01,,,01219000AB0094,,,,,,,,,,,,,0,1,Maison,85,3,S,sols,,,452,5.52141,45.802928
2023-7196,2023-07-10,000001,Vente,199000,65,,RTE DE MARCHAMP,0049,01680,01219,Lompnas,01,,,01219000AB0094,,,,,,,,,,,,,0,3,Dépendance,,0,S,sols,,,452,5.52141,45.802928
2023-8067,2023-06-30,000001,Vente,8000,,,SOUS CONFLON,B151,01680,01219,Lompnas,01,,,012190000A0090,,,,,,,,,,,,,0,,,,,BT,taillis simples,,,3938,5.499545,45.821466
2023-8067,2023-06-30,000001,Vente,8000,,,EN FAY,B072,01680,01219,Lompnas,01,,,012190000A0169,,,,,,,,,,,,,0,,,,,BT,taillis simples,,,1460,5.502683,45.815372
2023-8067,2023-06-30,000001,Vente,8000,,,EN BOUESCHE,B015,01680,01219,Lompnas,01,,,012190000A0233,,,,,,,,,,,,,0,,,,,L,landes,PATUR,Pâture plantée,660,5.516846,45.808384
2023-8067,2023-06-30,000001,Vente,8000,,,SUR PLAINE RAVOUIRE,B126,01680,01219,Lompnas,01,,,012190000A0274,,,,,,,,,,,,,0,,,,,L,landes,FRICH,Friche,1450,5.514806,45.80863
2023-8067,2023-06-30,000001,Vente,8000,,,LES ARANS,B003,01680,01219,Lompnas,01,,,012190000A0300,,,,,,,,,,,,,0,,,,,L,landes,FRICH,Friche,3810,5.512034,45.810175
2023-8067,2023-06-30,000001,Vente,8000,,,EN MALACRAS,B103,01680,01219,Lompnas,01,,,012190000A0362,,,,,,,,,,,,,0,,,,,BT,taillis simples,,,2860,5.519941,45.815539
2023-8067,2023-06-30,000001,Vente,8000,,,SOUS L AIGLIERE,B155,01680,01219,Lompnas,01,,,012190000A0375,,,,,,,,,,,,,0,,,,,BT,taillis simples,,,1642,5.518069,45.813267
2023-8067,2023-06-30,000001,Vente,8000,,,SOUS L AIGLIERE,B155,01680,01219,Lompnas,01,,,012190000A0376,,,,,,,,,,,,,0,,,,,BT,taillis simples,,,4055,5.517238,45.813579
2023-8067,2023-06-30,000001,Vente,8000,,,SOUS L AIGLIERE,B155,01680,01219,Lompnas,01,,,012190000A0391,,,,,,,,,,,,,0,,,,,BT,taillis simples,,,1512,5.516582,45.814349
2023-8067,2023-06-30,000001,Vente,8000,,,LE FERRARET,B075,01680,01219,Lompnas,01,,,012190000A0397,,,,,,,,,,,,,0,,,,,BT,taillis simples,,,2870,5.5156,45.812911
2023-8067,2023-06-30,000001,Vente,8000,,,LANNEVOIE,B096,01680,01219,Lompnas,01,,,012190000A0415,,,,,,,,,,,,,0,,,,,BT,taillis simples,,,1380,5.514449,45.813429
2023-8067,2023-06-30,000001,Vente,8000,,,LA COTE,B041,01680,01219,Lompnas,01,,,012190000A0447,,,,,,,,,,,,,0,,,,,BT,taillis simples,,,2790,5.509442,45.820561
2023-8067,2023-06-30,000001,Vente,8000,,,LA COTE,B041,01680,01219,Lompnas,01,,,012190000A0457,,,,,,,,,,,,,0,,,,,BT,taillis simples,,,9542,5.51149,45.819245
2023-8067,2023-06-30,000001,Vente,8000,,,SOUS LA COTE,B157,01680,01219,Lompnas,01,,,012190000A0476,,,,,,,,,,,,,0,,,,,BT,taillis simples,,,2032,5.510547,45.817318
2023-8067,2023-06-30,000001,Vente,8000,,,SOUS LA COTE,B157,01680,01219,Lompnas,01,,,012190000A0486,,,,,,,,,,,,,0,,,,,BT,taillis simples,,,1210,5.509135,45.818189
2023-8067,2023-06-30,000001,Vente,8000,,,SOUS LA COTE,B157,01680,01219,Lompnas,01,,,012190000A0492,,,,,,,,,,,,,0,,,,,BT,taillis simples,,,500,5.508039,45.819166
2023-8067,2023-06-30,000001,Vente,8000,,,SOUS LA COTE,B157,01680,01219,Lompnas,01,,,012190000A0503,,,,,,,,,,,,,0,,,,,L,landes,PATUR,Pâture plantée,3360,5.507734,45.818229
2023-8067,2023-06-30,000001,Vente,8000,,,SOUS LA COTE,B157,01680,01219,Lompnas,01,,,012190000A0511,,,,,,,,,,,,,0,,,,,L,landes,PATUR,Pâture plantée,1968,5.507352,45.819265
2023-8067,2023-06-30,000001,Vente,8000,,,SUR LE CHAMP DE LA ROCHE,B021,01680,01219,Lompnas,01,,,012190000B0225,,,,,,,,,,,,,0,,,,,BT,taillis simples,,,6890,5.516147,45.818324
2023-8067,2023-06-30,000001,Vente,8000,,,RENANT OUEST,B143,01680,01219,Lompnas,01,,,012190000B0279,,,,,,,,,,,,,0,,,,,BT,taillis simples,,,77,5.530262,45.819827
2023-8067,2023-06-30,000001,Vente,8000,,,COTE DES CHANAUX,B047,01680,01219,Lompnas,01,,,012190000C0271,,,,,,,,,,,,,0,,,,,BT,taillis simples,,,3957,5.545859,45.811105
2023-8067,2023-06-30,000001,Vente,8000,,,COMBE GERBEE,B033,01680,01219,Lompnas,01,,,012190000C0778,,,,,,,,,,,,,0,,,,,BT,taillis simples,,,960,5.538964,45.802428
2023-8067,2023-06-30,000001,Vente,8000,,,LA MEYRIEUX,B106,01680,01219,Lompnas,01,,,012190000C0847,,,,,,,,,,,,,0,,,,,BT,taillis simples,,,740,5.546511,45.798086
2023-8067,2023-06-30,000001,Vente,8000,,,CHAMP COUVECLET,B020,01680,01219,Lompnas,01,,,01219000ZB0044,,,,,,,,,,,,,0,,,,,BT,taillis simples,,,1660,5.508577,45.805146
2023-8067,2023-06-30,000001,Vente,8000,,,SOUS L HAIE,B156,01680,01219,Lompnas,01,,,01219000ZH0237,,,,,,,,,,,,,0,,,,,BT,taillis simples,,,3596,5.528904,45.789489
2023-8715,2023-07-13,000001,Vente,80000,15,,RTE DE MARCHAMP,0049,01680,01219,Lompnas,01,,,01219000AB0051,,,,,,,,,,,,,0,1,Maison,110,4,S,sols,,,219,5.521,45.803505
2023-12935,2023-11-23,000001,Vente,4000,,,EN MORNOUX,B116,01680,01219,Lompnas,01,,,01219000ZA0018,,,,,,,,,,,,,0,,,,,P,prés,,,4810,5.502095,45.822959
