id_mutation,date_mutation,numero_disposition,nature_mutation,valeur_fonciere,adresse_numero,adresse_suffixe,adresse_nom_voie,adresse_code_voie,code_postal,code_commune,nom_commune,code_departement,ancien_code_commune,ancien_nom_commune,id_parcelle,ancien_id_parcelle,numero_volume,lot1_numero,lot1_surface_carrez,lot2_numero,lot2_surface_carrez,lot3_numero,lot3_surface_carrez,lot4_numero,lot4_surface_carrez,lot5_numero,lot5_surface_carrez,nombre_lots,code_type_local,type_local,surface_reelle_bati,nombre_pieces_principales,code_nature_culture,nature_culture,code_nature_culture_speciale,nature_culture_speciale,surface_terrain,longitude,latitude
2023-330,2023-01-19,000001,Vente,2000,,,BOUIS,B015,01150,01444,Villebois,01,,,01444000AB0170,,,,,,,,,,,,,0,,,,,J,jardins,,,144,5.431875,45.857708
2023-1471,2023-02-07,000001,Vente,12000,5189,,RTE DE LA GARE,0042,01150,01444,Villebois,01,,,01444000AH0060,,,,,,,,,,,,,0,3,Dépendance,,0,S,sols,,,23,5.429114,45.843868
2023-1471,2023-02-07,000001,Vente,12000,,,LES BALMETTES,B008,01150,01444,Villebois,01,,,01444000AH0061,,,,,,,,,,,,,0,,,,,J,jardins,,,1120,5.429248,45.84386
2023-1719,2023-02-09,000001,Vente,45000,1060,,RUE DES DEUX FONTAINES,0029,01150,01444,Villebois,01,,,01444000AB0236,,,,,,,,,,,,,0,1,Maison,90,3,S,sols,,,71,5.431601,45.8565
2023-1829,2023-02-24,000001,Vente,150763,1304,,RUE DES DEUX FONTAINES,0029,01150,01444,Villebois,01,,,01444000AB0106,,,,,,,,,,,,,0,1,Maison,84,3,S,sols,,,213,5.42967,45.857553
2023-1829,2023-02-24,000001,Vente,150763,,,BOUIS,B015,01150,01444,Villebois,01,,,01444000AB0501,,,,,,,,,,,,,0,,,,,S,sols,,,31,5.429529,45.857585
2023-1913,2023-02-22,000001,Vente,176715,,,LA CROIX DE L OCTAVE,B043,01150,01444,Villebois,01,,,01444000AC0258,,,,,,,,,,,,,0,,,,,P,prés,,,1730,5.43092,45.849432
2023-1913,2023-02-22,000001,Vente,176715,,,LA CROIX DE L OCTAVE,B043,01150,01444,Villebois,01,,,01444000AC0259,,,,,,,,,,,,,0,,,,,P,prés,,,1495,5.43091,45.849101
2023-1913,2023-02-22,000001,Vente,176715,,,LA CROIX DE L OCTAVE,B043,01150,01444,Villebois,01,,,01444000AC0260,,,,,,,,,,,,,0,,,,,P,prés,,,275,5.431305,45.848989
2023-1913,2023-02-22,000001,Vente,176715,,,LA CROIX DE L OCTAVE,B043,01150,01444,Villebois,01,,,01444000AC0261,,,,,,,,,,,,,0,,,,,S,sols,,,325,5.431447,45.848933
2023-1913,2023-02-22,000001,Vente,176715,31,,CHE DE L OCTAVE,0162,01150,01444,Villebois,01,,,01444000AC0262,,,,,,,,,,,,,0,3,Dépendance,,0,S,sols,,,295,5.4316,45.848944
2023-1913,2023-02-22,000001,Vente,176715,31,,CHE DE L OCTAVE,0162,01150,01444,Villebois,01,,,01444000AC0262,,,,,,,,,,,,,0,3,Dépendance,,0,S,sols,,,295,5.4316,45.848944
2023-1913,2023-02-22,000001,Vente,176715,31,,CHE DE L OCTAVE,0162,01150,01444,Villebois,01,,,01444000AC0262,,,,,,,,,,,,,0,1,Maison,79,3,S,sols,,,295,5.4316,45.848944
2023-1913,2023-02-22,000001,Vente,176715,,,LA CROIX DE L OCTAVE,B043,01150,01444,Villebois,01,,,01444000AC0263,,,,,,,,,,,,,0,,,,,S,sols,,,130,5.431549,45.849071
2023-3451,2023-03-21,000001,Vente,149000,286,,PL DES LIONS,0154,01150,01444,Villebois,01,,,01444000AE0228,,,,,,,,,,,,,0,1,Maison,110,5,S,sols,,,110,5.435193,45.8471
2023-3454,2023-03-20,000001,Vente,68000,,,LA VERCHERE,B109,01150,01444,Villebois,01,,,01444000AE0630,,,,,,,,,,,,,0,,,,,S,sols,,,46,5.433895,45.848393
2023-3454,2023-03-20,000001,Vente,68000,,,LA VERCHERE,B109,01150,01444,Villebois,01,,,01444000AE0633,,,,,,,,,,,,,0,,,,,S,sols,,,344,5.433753,45.84835
2023-3454,2023-03-20,000001,Vente,68000,36,,RUE DE VOUGY,0094,01150,01444,Villebois,01,,,01444000AE0644,,,5,36.03,,,,,,,,,1,2,Appartement,34,2,,,,,,5.433967,45.848581
2023-3634,2023-03-09,000001,Vente,130000,,,SOUS BROSSIEUX,B104,01150,01444,Villebois,01,,,01444000AI0417,,,,,,,,,,,,,0,,,,,AB,terrains a bâtir,,,340,5.435436,45.840987
2023-3634,2023-03-09,000001,Vente,130000,,,SOUS BROSSIEUX,B104,01150,01444,Villebois,01,,,01444000AI0419,,,,,,,,,,,,,0,,,,,AB,terrains a bâtir,,,965,5.435507,45.840862
2023-3852,2023-03-31,000001,Vente,68000,121,,RUE DE LA GRANDE COMBE,0045,01150,01444,Villebois,01,,,01444000AB0519,,,,,,,,,,,,,0,3,Dépendance,,0,S,sols,,,576,5.430372,45.855021
2023-3852,2023-03-31,000001,Vente,68000,121,,RUE DE LA GRANDE COMBE,0045,01150,01444,Villebois,01,,,01444000AB0519,,,,,,,,,,,,,0,1,Maison,105,4,S,sols,,,576,5.430372,45.855021
2023-5386,2023-05-22,000001,Vente,138000,50,,CHE DU RIEZ,0172,01150,01444,Villebois,01,,,01444000AB0474,,,,,,,,,,,,,0,1,Maison,70,4,S,sols,,,569,5.430316,45.856156
2023-7237,2023-06-26,000001,Vente,179000,5395,,RUE DES DEUX FONTAINES,0029,01150,01444,Villebois,01,,,01444000AB0370,,,,,,,,,,,,,0,1,Maison,71,3,S,sols,,,50,5.431693,45.856164
2023-7237,2023-06-26,000001,Vente,179000,,,BOUIS,B015,01150,01444,Villebois,01,,,01444000AB0372,,,,,,,,,,,,,0,,,,,J,jardins,,,30,5.43198,45.856205
2023-7237,2023-06-26,000001,Vente,179000,,,LE CLODE,B031,01150,01444,Villebois,01,,,01444000AC0022,,,,,,,,,,,,,0,,,,,BT,taillis simples,,,1622,5.427308,45.853287
2023-7237,2023-06-26,000001,Vente,179000,,,LE RIEZ SUD,B096,01150,01444,Villebois,01,,,01444000AC0166,,,,,,,,,,,,,0,,,,,L,landes,,,127,5.427189,45.853575
2023-8319,2023-07-24,000001,Vente,175000,,,GRANDS PRES,B057,01150,01444,Villebois,01,,,01444000AH0035,,,,,,,,,,,,,0,,,,,P,prés,,,508,5.422604,45.842198
2023-8319,2023-07-24,000001,Vente,175000,,,AU PREAU,B090,01150,01444,Villebois,01,,,01444000AK0098,,,,,,,,,,,,,0,,,,,J,jardins,,,402,5.421482,45.841744
2023-8319,2023-07-24,000001,Vente,175000,720,,RTE DES HAUTS FOURNEAUX,0140,01150,01444,Villebois,01,,,01444000AL0049,,,,,,,,,,,,,0,4,Local industriel. commercial ou assimilé,350,0,S,sols,,,3235,5.42184,45.842489
2023-8319,2023-07-24,000001,Vente,175000,,,PRES AU PREAU,B091,01150,01444,Villebois,01,,,01444000AL0074,,,,,,,,,,,,,0,,,,,CH,chemin de fer,FER,Chemin de fer,165,5.421478,45.841956
2023-8319,2023-07-24,000001,Vente,175000,,,PRES AU PREAU,B091,01150,01444,Villebois,01,,,01444000AL0075,,,,,,,,,,,,,0,,,,,CH,chemin de fer,FER,Chemin de fer,1210,5.421579,45.842465
2023-8319,2023-07-24,000001,Vente,175000,,,PRES AU PREAU,B091,01150,01444,Villebois,01,,,01444000AL0086,,,,,,,,,,,,,0,,,,,J,jardins,,,962,5.421333,45.841949
2023-8685,2023-07-20,000001,Vente,1798.4,,,AU CLET,B030,01150,01444,Villebois,01,,,014440000A0021,,,,,,,,,,,,,0,,,,,L,landes,,,667,5.41947,45.86443
2023-8685,2023-07-20,000001,Vente,1798.4,,,LE RIEZ SUD,B096,01150,01444,Villebois,01,,,01444000AC0002,,,,,,,,,,,,,0,,,,,L,landes,,,666,5.425461,45.854175
2023-8685,2023-07-20,000001,Vente,1798.4,,,LE RIEZ SUD,B096,01150,01444,Villebois,01,,,01444000AC0010,,,,,,,,,,,,,0,,,,,L,landes,,,727,5.425716,45.85411
2023-8685,2023-07-20,000001,Vente,1798.4,,,LE RIEZ SUD,B096,01150,01444,Villebois,01,,,01444000AC0232,,,,,,,,,,,,,0,,,,,L,landes,,,188,5.425791,45.853984
2023-8898,2023-07-28,000001,Vente,195000,40,,QUARTIER DE LA GARE,0043,01150,01444,Villebois,01,,,01444000AK0179,,,,,,,,,,,,,0,1,Maison,120,4,S,sols,,,696,5.422107,45.84148
2023-8898,2023-07-28,000001,Vente,195000,40,,QUARTIER DE LA GARE,0043,01150,01444,Villebois,01,,,01444000AK0179,,,,,,,,,,,,,0,3,Dépendance,,0,S,sols,,,696,5.422107,45.84148
2023-8981,2023-08-04,000001,Vente,219000,29,,COUR DES ROSES,0175,01150,01444,Villebois,01,,,01444000AB0232,,,,,,,,,,,,,0,1,Maison,120,5,S,sols,,,205,5.432094,45.856644
2023-9052,2023-08-01,000001,Vente,199000,,,LE PERRON,B082,01150,01444,Villebois,01,,,01444000AE0342,,,,,,,,,,,,,0,,,,,S,sols,,,67,5.435034,45.84572
2023-9052,2023-08-01,000001,Vente,199000,5075,,RTE DE SERRIERES,0075,01150,01444,Villebois,01,,,01444000AE0343,,,,,,,,,,,,,0,1,Maison,68,4,S,sols,,,252,5.434946,45.845584
2023-9052,2023-08-01,000001,Vente,199000,,,LE PERRON,B082,01150,01444,Villebois,01,,,01444000AE0571,,,,,,,,,,,,,0,,,,,S,sols,,,124,5.434859,45.84576
2023-9162,2023-08-03,000001,Vente,99000,,,SOUS LE MAS,B105,01150,01444,Villebois,01,,,01444000AC0042,,,,,,,,,,,,,0,,,,,J,jardins,,,468,5.433877,45.852466
2023-9162,2023-08-03,000001,Vente,99000,39,,RUE DES ECOLES,0034,01150,01444,Villebois,01,,,01444000AE0084,,,,,,,,,,,,,0,1,Maison,88,3,S,sols,,,46,5.434496,45.849482
2023-9716,2023-08-24,000001,Vente,526,,,LE MOUTINET,B074,01150,01444,Villebois,01,,,014440000C0377,,,,,,,,,,,,,0,,,,,VI,vignes,,,1193,5.436013,45.852123
2023-9716,2023-08-24,000001,Vente,526,,,LE MAS,B069,01150,01444,Villebois,01,,,014440000C0496,,,,,,,,,,,,,0,,,,,VI,vignes,,,1437,5.434876,45.851753
2023-10743,2023-09-28,000001,Vente,90900,5385,,RUE DE LA LABE,0150,01150,01444,Villebois,01,,,01444000AB0340,,,,,,,,,,,,,0,1,Maison,75,3,S,sols,,,53,5.43139,45.855537
2023-10835,2023-10-10,000001,Vente,87500,,,LA VERCHERE,B109,01150,01444,Villebois,01,,,01444000AE0630,,,,,,,,,,,,,0,,,,,S,sols,,,46,5.433895,45.848393
2023-10835,2023-10-10,000001,Vente,87500,,,LA VERCHERE,B109,01150,01444,Villebois,01,,,01444000AE0633,,,,,,,,,,,,,0,,,,,S,sols,,,344,5.433753,45.84835
2023-10835,2023-10-10,000001,Vente,87500,36,,RUE DE VOUGY,0094,01150,01444,Villebois,01,,,01444000AE0644,,,3,,,,,,,,,,1,2,Appartement,20,1,,,,,,5.433967,45.848581
2023-10835,2023-10-10,000001,Vente,87500,36,,RUE DE VOUGY,0094,01150,01444,Villebois,01,,,01444000AE0644,,,2,,,,,,,,,,1,2,Appartement,20,1,,,,,,5.433967,45.848581
2023-10835,2023-10-10,000001,Vente,87500,36,,RUE DE VOUGY,0094,01150,01444,Villebois,01,,,01444000AE0644,,,2,,,,,,,,,,1,3,Dépendance,,0,,,,,,5.433967,45.848581
2023-11208,2023-10-11,000001,Vente,100000,15,,COUR DE SAULT,0178,01150,01444,Villebois,01,,,01444000AB0096,,,,,,,,,,,,,0,1,Maison,51,2,S,sols,,,41,5.430057,45.857145
2023-11208,2023-10-11,000001,Vente,100000,,,BOUIS,B015,01150,01444,Villebois,01,,,01444000AB0097,,,,,,,,,,,,,0,,,,,S,sols,,,120,5.430044,45.857231
2023-11223,2023-06-16,000001,Vente,40000,50,,RTE DE LA GARE,0042,01150,01444,Villebois,01,,,01444000AE0016,,,,,,,,,,,,,0,1,Maison,66,3,S,sols,,,35,5.433185,45.846739
2023-11687,2023-10-20,000002,Vente,40000,,,LACARIA,B064,01150,01444,Villebois,01,,,014440000C1893,,,,,,,,,,,,,0,,,,,VI,vignes,,,858,,
2023-11687,2023-10-20,000002,Vente,40000,,,LACARIA,B064,01150,01444,Villebois,01,,,014440000C1895,,,,,,,,,,,,,0,,,,,VI,vignes,,,37,,
2023-11688,2023-10-20,000001,Vente,5000,,,BOLAROS,B013,01150,01444,Villebois,01,,,014440000C0568,,,,,,,,,,,,,0,,,,,T,terres,,,251,5.437677,45.843454
2023-12043,2023-11-06,000001,Vente,178410,34,,COUR DE SERRIERES,0179,01150,01444,Villebois,01,,,01444000AE0327,,,,,,,,,,,,,0,3,Dépendance,,0,S,sols,,,128,5.434853,45.846307
2023-12043,2023-11-06,000001,Vente,178410,34,,COUR DE SERRIERES,0179,01150,01444,Villebois,01,,,01444000AE0327,,,,,,,,,,,,,0,1,Maison,80,3,S,sols,,,128,5.434853,45.846307
2023-12043,2023-11-06,000001,Vente,178410,,,LE PERRON,B082,01150,01444,Villebois,01,,,01444000AE0463,,,,,,,,,,,,,0,,,,,S,sols,,,44,5.434837,45.846397
2023-12567,2023-11-09,000001,Vente,179000,58,,RTE DE LA GARE,0042,01150,01444,Villebois,01,,,01444000AE0018,,,,,,,,,,,,,0,1,Maison,90,3,S,sols,,,86,5.433029,45.846783
2023-13388,2023-12-11,000001,Vente,17000,,,SOUS BROSSIEUX,B104,01150,01444,Villebois,01,,,01444000AI0019,,,,,,,,,,,,,0,,,,,J,jardins,,,579,5.436522,45.841059
2023-13388,2023-12-11,000001,Vente,17000,,,LA CROIX TRIEUX,B044,01150,01444,Villebois,01,,,01444000AI0043,,,,,,,,,,,,,0,,,,,P,prés,,,658,5.433824,45.842386
2023-13388,2023-12-11,000001,Vente,17000,,,CREUX DES PLANTEES,B041,01150,01444,Villebois,01,,,014440000C1204,,,,,,,,,,,,,0,,,,,BT,taillis simples,,,235,5.438362,45.837182
