id_mutation,date_mutation,numero_disposition,nature_mutation,valeur_fonciere,adresse_numero,adresse_suffixe,adresse_nom_voie,adresse_code_voie,code_postal,code_commune,nom_commune,code_departement,ancien_code_commune,ancien_nom_commune,id_parcelle,ancien_id_parcelle,numero_volume,lot1_numero,lot1_surface_carrez,lot2_numero,lot2_surface_carrez,lot3_numero,lot3_surface_carrez,lot4_numero,lot4_surface_carrez,lot5_numero,lot5_surface_carrez,nombre_lots,code_type_local,type_local,surface_reelle_bati,nombre_pieces_principales,code_nature_culture,nature_culture,code_nature_culture_speciale,nature_culture_speciale,surface_terrain,longitude,latitude
2023-22253,2023-11-07,000001,Vente,21197.15,,,LA GRANGE AUX BOIS,B041,02500,02055,Beaumé,02,,,020550000A0579,,,,,,,,,,,,,0,,,,,T,terres,,,31291,4.155329,49.823337
2023-22253,2023-11-07,000001,Vente,21197.15,,,LE CHEMIN D AUBENTON,B015,02500,02055,Beaumé,02,,,020550000A0582,,,,,,,,,,,,,0,,,,,T,terres,,,1320,4.154428,49.8236
2023-22897,2023-11-28,000001,Vente,138000,,,LA FEUILLETTE,B029,02500,02055,Beaumé,02,,,020550000B0221,,,,,,,,,,,,,0,,,,,BP,peupleraies,,,8137,4.145781,49.837379
2023-22897,2023-11-28,000001,Vente,138000,,,LA FEUILLETTE,B029,02500,02055,Beaumé,02,,,020550000B0223,,,,,,,,,,,,,0,,,,,BF,futaies feuillues,,,2018,4.147339,49.838227
2023-22897,2023-11-28,000001,Vente,138000,,,LE VILLAGE,B080,02500,02055,Beaumé,02,,,020550000B0234,,,,,,,,,,,,,0,,,,,J,jardins,,,947,4.149307,49.837792
2023-22897,2023-11-28,000001,Vente,138000,6,,RUE DE L EGLISE,0016,02500,02055,Beaumé,02,,,020550000B0235,,,,,,,,,,,,,0,1,Maison,104,3,S,sols,,,2065,4.14983,49.83738
2023-22897,2023-11-28,000001,Vente,138000,,,LE VILLAGE,B080,02500,02055,Beaumé,02,,,020550000B0238,,,,,,,,,,,,,0,,,,,J,jardins,,,4200,4.149141,49.837276
2023-22897,2023-11-28,000001,Vente,138000,,,LA MARNIERE,B047,02500,02055,Beaumé,02,,,020550000B0258,,,,,,,,,,,,,0,,,,,L,landes,,,1097,4.139856,49.837462
2023-22897,2023-11-28,000001,Vente,138000,,,LA FEUILLETTE,B029,02500,02055,Beaumé,02,,,020550000B0292,,,,,,,,,,,,,0,,,,,BF,futaies feuillues,,,3725,4.145803,49.837844
2023-22897,2023-11-28,000001,Vente,138000,,,LA FEUILLETTE,B029,02500,02055,Beaumé,02,,,020550000B0293,,,,,,,,,,,,,0,,,,,BF,futaies feuillues,,,342,4.145743,49.837727
2023-22897,2023-11-28,000001,Vente,138000,,,LA FEUILLETTE,B029,02500,02055,Beaumé,02,,,020550000B0294,,,,,,,,,,,,,0,,,,,BF,futaies feuillues,,,14228,4.147925,49.837869
2023-22966,2023-12-14,000001,Vente,85000,7,,RUE DESMARETZ,0012,02500,02055,Beaumé,02,,,02055000ZB0048,,,,,,,,,,,,,0,1,Maison,90,4,S,sols,,,920,4.169257,49.83373
2023-22966,2023-12-14,000001,Vente,85000,7,,RUE DESMARETZ,0012,02500,02055,Beaumé,02,,,02055000ZB0048,,,,,,,,,,,,,0,1,Maison,90,4,PA,pâtures,,,4462,4.169257,49.83373
2023-22966,2023-12-14,000001,Vente,85000,7,,RUE DESMARETZ,0012,02500,02055,Beaumé,02,,,02055000ZB0048,,,,,,,,,,,,,0,1,Maison,90,4,J,jardins,,,858,4.169257,49.83373
2023-23228,2023-12-20,000001,Vente,5200,,,LA RIFLETTE,B072,02500,02055,Beaumé,02,,,020550000B0284,,,,,,,,,,,,,0,,,,,PA,pâtures,,,2784,4.137317,49.830136
2023-23228,2023-12-20,000001,Vente,5200,,,LA RIFLETTE,B072,02500,02055,Beaumé,02,,,020550000B0285,,,,,,,,,,,,,0,,,,,PA,pâtures,,,3089,4.137046,49.829811
