id_mutation,date_mutation,numero_disposition,nature_mutation,valeur_fonciere,adresse_numero,adresse_suffixe,adresse_nom_voie,adresse_code_voie,code_postal,code_commune,nom_commune,code_departement,ancien_code_commune,ancien_nom_commune,id_parcelle,ancien_id_parcelle,numero_volume,lot1_numero,lot1_surface_carrez,lot2_numero,lot2_surface_carrez,lot3_numero,lot3_surface_carrez,lot4_numero,lot4_surface_carrez,lot5_numero,lot5_surface_carrez,nombre_lots,code_type_local,type_local,surface_reelle_bati,nombre_pieces_principales,code_nature_culture,nature_culture,code_nature_culture_speciale,nature_culture_speciale,surface_terrain,longitude,latitude
2023-13713,2023-01-12,000001,Vente,33000,,,LE BAS DU CHEMIN DES VACHE,B003,02300,02173,Chauny,02,,,02173000AW0542,,,,,,,,,,,,,0,,,,,J,jardins,MARAI,Pré marais,702,3.213502,49.61147
2023-13720,2023-01-13,000001,Vente,106000,88,,BD DE BAD KOSTRITZ,0117,02300,02173,Chauny,02,,,02173000AM0523,,,,,,,,,,,,,0,1,Maison,64,3,S,sols,,,228,3.206084,49.617503
2023-13720,2023-01-13,000001,Vente,106000,88,,BD DE BAD KOSTRITZ,0117,02300,02173,Chauny,02,,,02173000AM0523,,,,,,,,,,,,,0,3,Dépendance,,0,S,sols,,,228,3.206084,49.617503
2023-13720,2023-01-13,000001,Vente,106000,88,,BD DE BAD KOSTRITZ,0117,02300,02173,Chauny,02,,,02173000AM0523,,,,,,,,,,,,,0,3,Dépendance,,0,S,sols,,,228,3.206084,49.617503
2023-13720,2023-01-13,000001,Vente,106000,,,BD DE BAD KOSTRITZ,0117,02300,02173,Chauny,02,,,02173000AM0602,,,,,,,,,,,,,0,,,,,S,sols,,,21,3.205925,49.617514
2023-13743,2023-01-16,000001,Vente,170000,4,,RUE EMILE LEROY,0450,02300,02173,Chauny,02,,,02173000AD0025,,,,,,,,,,,,,0,3,Dépendance,,0,S,sols,,,114,3.222928,49.613155
2023-13743,2023-01-16,000001,Vente,170000,4,,RUE EMILE LEROY,0450,02300,02173,Chauny,02,,,02173000AD0025,,,,,,,,,,,,,0,1,Maison,70,3,S,sols,,,114,3.222928,49.613155
2023-13750,2023-01-06,000001,Vente,133500,7,B,RUE DE LA JUSTICE,0840,02300,02173,Chauny,02,,,02173000AN0412,,,,,,,,,,,,,0,,,,,S,sols,,,540,3.218449,49.619739
2023-13750,2023-01-06,000001,Vente,133500,7,B,RUE DE LA JUSTICE,0840,02300,02173,Chauny,02,,,02173000AN0413,,,,,,,,,,,,,0,,,,,S,sols,,,653,3.21807,49.619486
2023-13758,2023-01-16,000001,Vente,183000,24,,RUE ARTHUR LACROIX,0110,02300,02173,Chauny,02,,,02173000AD0109,,,2,,7,,,,,,,,2,3,Dépendance,,0,,,,,,3.222327,49.612005
2023-13758,2023-01-16,000001,Vente,183000,24,,RUE ARTHUR LACROIX,0110,02300,02173,Chauny,02,,,02173000AD0109,,,2,,7,,,,,,,,2,3,Dépendance,,0,,,,,,3.222327,49.612005
2023-13758,2023-01-16,000001,Vente,183000,24,,RUE ARTHUR LACROIX,0110,02300,02173,Chauny,02,,,02173000AD0109,,,2,,7,,,,,,,,2,2,Appartement,120,5,,,,,,3.222327,49.612005
2023-13939,2023-01-23,000001,Vente,430000,23,,RUE DU GENERAL LECLERC,0620,02300,02173,Chauny,02,,,02173000AC0156,,,,,,,,,,,,,0,,,,,S,sols,,,115,3.217761,49.613926
2023-13939,2023-01-23,000001,Vente,430000,30,,RUE ARISTIDE BRIAND,0100,02300,02173,Chauny,02,,,02173000AC0167,,,,,,,,,,,,,0,1,Maison,255,6,S,sols,,,1641,3.217675,49.613767
2023-14076,2023-02-01,000001,Vente,104000,84,,RUE DU BAILLY,0120,02300,02173,Chauny,02,,,02173000AW0215,,,,,,,,,,,,,0,3,Dépendance,,0,S,sols,,,520,3.212554,49.609404
2023-14076,2023-02-01,000001,Vente,104000,84,,RUE DU BAILLY,0120,02300,02173,Chauny,02,,,02173000AW0215,,,,,,,,,,,,,0,1,Maison,65,4,S,sols,,,520,3.212554,49.609404
2023-14076,2023-02-01,000001,Vente,104000,84,,RUE DU BAILLY,0120,02300,02173,Chauny,02,,,02173000AW0215,,,,,,,,,,,,,0,3,Dépendance,,0,S,sols,,,520,3.212554,49.609404
2023-14104,2023-01-26,000001,Vente,133000,5,,RUE PABLO CASALS,1085,02300,02173,Chauny,02,,,02173000BC0110,,,,,,,,,,,,,0,3,Dépendance,,0,S,sols,,,472,3.203425,49.623445
2023-14104,2023-01-26,000001,Vente,133000,5,,RUE PABLO CASALS,1085,02300,02173,Chauny,02,,,02173000BC0110,,,,,,,,,,,,,0,1,Maison,79,4,S,sols,,,472,3.203425,49.623445
2023-14105,2023-01-30,000001,Vente,110000,7,B,RUE DE LA JUSTICE,0840,02300,02173,Chauny,02,,,02173000AN0409,,,,,,,,,,,,,0,,,,,S,sols,,,317,3.217828,49.619596
2023-14105,2023-01-30,000001,Vente,110000,7,B,RUE DE LA JUSTICE,0840,02300,02173,Chauny,02,,,02173000AN0413,,,,,,,,,,,,,0,,,,,S,sols,,,653,3.21807,49.619486
2023-14126,2023-01-26,000001,Vente,60900,101,,RUE CAMILLE DESMOULINS,0220,02300,02173,Chauny,02,,,02173000AX0171,,,,,,,,,,,,,0,3,Dépendance,,0,J,jardins,,,213,3.202522,49.612355
2023-14126,2023-01-26,000001,Vente,60900,101,,RUE CAMILLE DESMOULINS,0220,02300,02173,Chauny,02,,,02173000AX0171,,,,,,,,,,,,,0,3,Dépendance,,0,S,sols,,,153,3.202522,49.612355
2023-14126,2023-01-26,000001,Vente,60900,101,,RUE CAMILLE DESMOULINS,0220,02300,02173,Chauny,02,,,02173000AX0171,,,,,,,,,,,,,0,1,Maison,50,4,S,sols,,,153,3.202522,49.612355
2023-14126,2023-01-26,000001,Vente,60900,101,,RUE CAMILLE DESMOULINS,0220,02300,02173,Chauny,02,,,02173000AX0171,,,,,,,,,,,,,0,3,Dépendance,,0,S,sols,,,153,3.202522,49.612355
2023-14126,2023-01-26,000001,Vente,60900,101,,RUE CAMILLE DESMOULINS,0220,02300,02173,Chauny,02,,,02173000AX0171,,,,,,,,,,,,,0,3,Dépendance,,0,J,jardins,,,213,3.202522,49.612355
2023-14126,2023-01-26,000001,Vente,60900,101,,RUE CAMILLE DESMOULINS,0220,02300,02173,Chauny,02,,,02173000AX0171,,,,,,,,,,,,,0,1,Maison,50,4,J,jardins,,,213,3.202522,49.612355
2023-14177,2023-02-07,000001,Vente,49900,41,H,RUE DROUOT,0420,02300,02173,Chauny,02,,,02173000AK0050,,,,,,,,,,,,,0,1,Maison,55,3,S,sols,,,36,3.216576,49.612851
2023-14177,2023-02-07,000001,Vente,49900,41,,RUE DROUOT,0420,02300,02173,Chauny,02,,,02173000AK0053,,,,,,,,,,,,,0,,,,,S,sols,,,159,3.216612,49.612809
2023-14177,2023-02-07,000001,Vente,49900,41,C,RUE DROUOT,0420,02300,02173,Chauny,02,,,02173000AK0056,,,,,,,,,,,,,0,3,Dépendance,,0,S,sols,,,10,3.216609,49.612738
2023-14370,2023-02-10,000001,Vente,42716.16,,,LA BELLE CROIX,B007,02300,02173,Chauny,02,,,02173000ZD0238,,,,,,,,,,,,,0,,,,,T,terres,,,485,3.22892,49.627898
2023-14370,2023-02-10,000001,Vente,42716.16,,,LA BELLE CROIX,B007,02300,02173,Chauny,02,,,02173000ZD0249,,,,,,,,,,,,,0,,,,,T,terres,,,208,3.228701,49.627838
2023-14370,2023-02-10,000001,Vente,42716.16,,,LA BELLE CROIX,B007,02300,02173,Chauny,02,,,02173000ZD0303,,,,,,,,,,,,,0,,,,,T,terres,,,75,3.228604,49.627852
2023-14373,2023-02-02,000001,Vente,45126,62,E,RUE GEO LUFBERY,0630,02300,02173,Chauny,02,,,02173000BO0194,,,,,,,,,,,,,0,,,,,PA,pâtures,,,15042,3.237556,49.615584
2023-14388,2023-02-03,000001,Vente,31954,,,LA GRENOUILLERE,B084,02300,02173,Chauny,02,,,02173000ZI0020,,,,,,,,,,,,,0,,,,,PA,pâtures,,,31954,3.205205,49.609366
2023-14390,2023-02-10,000001,Vente,68800,34,,RUE LEON JOUHAUX,0878,02300,02173,Chauny,02,,,02173000BC0365,,,,,,,,,,,,,0,1,Maison,78,4,S,sols,,,173,3.204382,49.625672
2023-14496,2023-02-03,000001,Vente,43005,,,LA BRIQUETERIE,B009,02300,02173,Chauny,02,,,02173000AO0344,,,,,,,,,,,,,0,,,,,S,sols,,,4,3.221688,49.627276
2023-14496,2023-02-03,000001,Vente,43005,,,AU DESSUS DE LA JUSTICE,B026,02300,02173,Chauny,02,,,02173000BI0203,,,,,,,,,,,,,0,,,,,T,terres,,,4696,3.221799,49.62771
2023-14500,2023-02-04,000001,Vente,79000,15,,RUE DESMAREST,0400,02300,02173,Chauny,02,,,02173000AE0076,,,,,,,,,,,,,0,1,Maison,81,6,S,sols,,,83,3.221886,49.610807
2023-14500,2023-02-04,000001,Vente,79000,15,,RUE DESMAREST,0400,02300,02173,Chauny,02,,,02173000AE0076,,,,,,,,,,,,,0,3,Dépendance,,0,S,sols,,,83,3.221886,49.610807
2023-14505,2023-02-07,000001,Vente,230000,21,,RUE DESMAREST,0400,02300,02173,Chauny,02,,,02173000AE0227,,,,,,,,,,,,,0,2,Appartement,57,2,S,sols,,,264,3.222207,49.610925
2023-14505,2023-02-07,000001,Vente,230000,21,,RUE DESMAREST,0400,02300,02173,Chauny,02,,,02173000AE0227,,,,,,,,,,,,,0,3,Dépendance,,0,S,sols,,,264,3.222207,49.610925
2023-14505,2023-02-07,000001,Vente,230000,21,,RUE DESMAREST,0400,02300,02173,Chauny,02,,,02173000AE0227,,,,,,,,,,,,,0,3,Dépendance,,0,S,sols,,,264,3.222207,49.610925
2023-14505,2023-02-07,000001,Vente,230000,21,,RUE DESMAREST,0400,02300,02173,Chauny,02,,,02173000AE0227,,,,,,,,,,,,,0,4,Local industriel. commercial ou assimilé,63,0,S,sols,,,264,3.222207,49.610925
2023-14505,2023-02-07,000001,Vente,230000,21,,RUE DESMAREST,0400,02300,02173,Chauny,02,,,02173000AE0227,,,,,,,,,,,,,0,2,Appartement,98,3,S,sols,,,264,3.222207,49.610925
2023-14508,2023-02-10,000001,Vente,180000,18,,RUE EMILE ZOLA,0460,02300,02173,Chauny,02,,,02173000AE0253,,,8,81.04,,,,,,,,,1,2,Appartement,81,3,,,,,,3.217098,49.611215
2023-14508,2023-02-10,000001,Vente,180000,18,,RUE EMILE ZOLA,0460,02300,02173,Chauny,02,,,02173000AE0253,,,50,,,,,,,,,,1,3,Dépendance,,0,,,,,,3.217098,49.611215
2023-14508,2023-02-10,000001,Vente,180000,18,,RUE EMILE ZOLA,0460,02300,02173,Chauny,02,,,02173000AE0253,,,36,,,,,,,,,,1,3,Dépendance,,0,,,,,,3.217098,49.611215
2023-14535,2023-01-27,000001,Vente,75000,8,,AV HENRI DUNANT,0695,02300,02173,Chauny,02,,,02173000AZ0348,,,,,,,,,,,,,0,1,Maison,80,5,S,sols,,,668,3.209076,49.622049
2023-14535,2023-01-27,000001,Vente,75000,8,,AV HENRI DUNANT,0695,02300,02173,Chauny,02,,,02173000AZ0348,,,,,,,,,,,,,0,3,Dépendance,,0,S,sols,,,668,3.209076,49.622049
2023-14590,2023-01-30,000001,Vente,127900,30,,BD D ANDENNE,0080,02300,02173,Chauny,02,,,02173000AM0373,,,,,,,,,,,,,0,1,Maison,73,4,S,sols,,,449,3.2056,49.618773
2023-14624,2023-01-11,000001,Vente,82000,50,,RUE DU BROUAGE,0210,02300,02173,Chauny,02,,,02173000AL0032,,,,,,,,,,,,,0,1,Maison,94,3,S,sols,,,392,3.210336,49.614879
2023-14672,2023-02-03,000001,Vente,257850,43,,RUE LUCIE AUBRAC,0923,02300,02173,Chauny,02,,,02173000ZK0105,,,,,,,,,,,,,0,1,Maison,144,6,S,sols,,,765,3.202499,49.617642
2023-14716,2023-02-22,000001,Vente,91000,7,,SQ DES PENSEES,1140,02300,02173,Chauny,02,,,02173000AM0333,,,,,,,,,,,,,0,1,Maison,64,4,S,sols,,,783,3.206473,49.617406
2023-14716,2023-02-22,000001,Vente,91000,7,,SQ DES PENSEES,1140,02300,02173,Chauny,02,,,02173000AM0333,,,,,,,,,,,,,0,3,Dépendance,,0,S,sols,,,783,3.206473,49.617406
2023-14727,2023-02-28,000001,Vente,58000,38,,RUE VOLTAIRE,1470,02300,02173,Chauny,02,,,02173000AT0012,,,,,,,,,,,,,0,3,Dépendance,,0,S,sols,,,45,3.218939,49.606913
2023-14727,2023-02-28,000001,Vente,58000,38,,RUE VOLTAIRE,1470,02300,02173,Chauny,02,,,02173000AT0012,,,,,,,,,,,,,0,1,Maison,70,3,S,sols,,,45,3.218939,49.606913
2023-14729,2023-02-20,000001,Vente,100000,2,,RUE MAURICE BOUCHOR,0995,02300,02173,Chauny,02,,,02173000AK0074,,,,,,,,,,,,,0,1,Maison,90,4,S,sols,,,465,3.216758,49.612301
2023-14729,2023-02-20,000001,Vente,100000,2,,RUE MAURICE BOUCHOR,0995,02300,02173,Chauny,02,,,02173000AK0074,,,,,,,,,,,,,0,3,Dépendance,,0,S,sols,,,465,3.216758,49.612301
2023-14729,2023-02-20,000001,Vente,100000,2,,RUE MAURICE BOUCHOR,0995,02300,02173,Chauny,02,,,02173000AK0074,,,,,,,,,,,,,0,3,Dépendance,,0,S,sols,,,465,3.216758,49.612301
2023-14873,2023-02-22,000001,Vente,120000,8,,RUE MOMBLE COURBOIN,1020,02300,02173,Chauny,02,,,02173000AH0032,,,,,,,,,,,,,0,3,Dépendance,,0,S,sols,,,221,3.220079,49.608213
2023-14873,2023-02-22,000001,Vente,120000,8,,RUE MOMBLE COURBOIN,1020,02300,02173,Chauny,02,,,02173000AH0032,,,,,,,,,,,,,0,3,Dépendance,,0,S,sols,,,221,3.220079,49.608213
2023-14873,2023-02-22,000001,Vente,120000,8,,RUE MOMBLE COURBOIN,1020,02300,02173,Chauny,02,,,02173000AH0032,,,,,,,,,,,,,0,1,Maison,91,3,S,sols,,,221,3.220079,49.608213
2023-14925,2023-03-03,000001,Vente,72000,10,B,RUE JULIETTE LAMBERT,0820,02300,02173,Chauny,02,,,02173000AE0046,,,4,,,,,,,,,,1,2,Appartement,62,2,,,,,,3.220105,49.611601
2023-14925,2023-03-03,000001,Vente,72000,10,B,RUE JULIETTE LAMBERT,0820,02300,02173,Chauny,02,,,02173000AE0046,,,4,,,,,,,,,,1,3,Dépendance,,0,,,,,,3.220105,49.611601
2023-14925,2023-03-03,000001,Vente,72000,10,B,RUE JULIETTE LAMBERT,0820,02300,02173,Chauny,02,,,02173000AE0046,,,21,48.19,,,,,,,,,1,2,Appartement,90,4,,,,,,3.220105,49.611601
2023-14925,2023-03-03,000001,Vente,72000,10,B,RUE JULIETTE LAMBERT,0820,02300,02173,Chauny,02,,,02173000AE0046,,,21,48.19,,,,,,,,,1,3,Dépendance,,0,,,,,,3.220105,49.611601
2023-15052,2023-03-07,000001,Vente,170000,6,,RUE DE LA CHAUSSEE,0270,02300,02173,Chauny,02,,,02173000AE0212,,,,,,,,,,,,,0,4,Local industriel. commercial ou assimilé,84,0,S,sols,,,193,3.219362,49.611824
2023-15052,2023-03-07,000001,Vente,170000,6,,RUE DE LA CHAUSSEE,0270,02300,02173,Chauny,02,,,02173000AE0212,,,,,,,,,,,,,0,3,Dépendance,,0,S,sols,,,193,3.219362,49.611824
2023-15052,2023-03-07,000001,Vente,170000,6,,RUE DE LA CHAUSSEE,0270,02300,02173,Chauny,02,,,02173000AE0212,,,,,,,,,,,,,0,1,Maison,44,2,S,sols,,,193,3.219362,49.611824
2023-15052,2023-03-07,000001,Vente,170000,6,,RUE DE LA CHAUSSEE,0270,02300,02173,Chauny,02,,,02173000AE0212,,,,,,,,,,,,,0,1,Maison,84,3,J,jardins,,,47,3.219362,49.611824
2023-15052,2023-03-07,000001,Vente,170000,6,,RUE DE LA CHAUSSEE,0270,02300,02173,Chauny,02,,,02173000AE0212,,,,,,,,,,,,,0,4,Local industriel. commercial ou assimilé,84,0,J,jardins,,,47,3.219362,49.611824
2023-15052,2023-03-07,000001,Vente,170000,6,,RUE DE LA CHAUSSEE,0270,02300,02173,Chauny,02,,,02173000AE0212,,,,,,,,,,,,,0,1,Maison,44,2,J,jardins,,,47,3.219362,49.611824
2023-15052,2023-03-07,000001,Vente,170000,6,,RUE DE LA CHAUSSEE,0270,02300,02173,Chauny,02,,,02173000AE0212,,,,,,,,,,,,,0,3,Dépendance,,0,J,jardins,,,47,3.219362,49.611824
2023-15052,2023-03-07,000001,Vente,170000,6,,RUE DE LA CHAUSSEE,0270,02300,02173,Chauny,02,,,02173000AE0212,,,,,,,,,,,,,0,1,Maison,84,3,S,sols,,,193,3.219362,49.611824
2023-15052,2023-03-07,000001,Vente,170000,4,,RUE DE LA CHAUSSEE,0270,02300,02173,Chauny,02,,,02173000AE0215,,,,,,,,,,,,,0,,,,,S,sols,,,25,3.219133,49.611903
2023-15216,2023-03-10,000001,Vente,89000,1,,RUE ALBERT DUVAL,0010,02300,02173,Chauny,02,,,02173000AR0542,,,7,,,,,,,,,,1,3,Dépendance,,0,,,,,,3.224699,49.617033
2023-15216,2023-03-10,000001,Vente,89000,1,,RUE ALBERT DUVAL,0010,02300,02173,Chauny,02,,,02173000AR0542,,,1,,,,,,,,,,1,2,Appartement,72,4,,,,,,3.224699,49.617033
2023-15216,2023-03-10,000001,Vente,89000,1,,RUE ALBERT DUVAL,0010,02300,02173,Chauny,02,,,02173000AR0542,,,13,,,,,,,,,,1,3,Dépendance,,0,,,,,,3.224699,49.617033
2023-15252,2023-03-10,000001,Vente,116500,8,,ALL DES MARGUERITES,0970,02300,02173,Chauny,02,,,02173000AZ0383,,,,,,,,,,,,,0,1,Maison,72,4,S,sols,,,639,3.206653,49.621107
2023-15253,2023-03-07,000001,Vente,190000,40,,BD DE BERGHEIM,0175,02300,02173,Chauny,02,,,02173000AZ0361,,,,,,,,,,,,,0,4,Local industriel. commercial ou assimilé,103,0,S,sols,,,400,3.209466,49.621275
2023-15253,2023-03-07,000001,Vente,190000,40,,BD DE BERGHEIM,0175,02300,02173,Chauny,02,,,02173000AZ0361,,,,,,,,,,,,,0,3,Dépendance,,0,S,sols,,,400,3.209466,49.621275
2023-15253,2023-03-07,000001,Vente,190000,40,,BD DE BERGHEIM,0175,02300,02173,Chauny,02,,,02173000AZ0361,,,,,,,,,,,,,0,1,Maison,159,5,S,sols,,,400,3.209466,49.621275
2023-15265,2023-03-02,000001,Vente,138000,10,,RUE DE LA PAIX,1090,02300,02173,Chauny,02,,,02173000AN0372,,,12,,26,91.34,,,,,,,2,2,Appartement,97,3,,,,,,3.218357,49.616316
2023-15265,2023-03-02,000001,Vente,138000,10,,RUE DE LA PAIX,1090,02300,02173,Chauny,02,,,02173000AN0372,,,32,,,,,,,,,,1,3,Dépendance,,0,,,,,,3.218357,49.616316
2023-15265,2023-03-02,000001,Vente,138000,10,,RUE DE LA PAIX,1090,02300,02173,Chauny,02,,,02173000AN0372,,,12,,26,91.34,,,,,,,2,3,Dépendance,,0,,,,,,3.218357,49.616316
2023-15279,2023-03-10,000001,Vente,450000,3,,RUE ALEXANDRE FOURNY,0020,02300,02173,Chauny,02,,,02173000AO0334,,,,,,,,,,,,,0,4,Local industriel. commercial ou assimilé,514,0,S,sols,,,1495,3.220092,49.626416
2023-15366,2023-03-16,000001,Vente,141100,8,,RUE DE LA CHAUSSEE,0270,02300,02173,Chauny,02,,,02173000AE0206,,,18,,,,,,,,,,1,3,Dépendance,,0,,,,,,3.219045,49.61175
2023-15366,2023-03-16,000001,Vente,141100,8,,RUE DE LA CHAUSSEE,0270,02300,02173,Chauny,02,,,02173000AE0206,,,12,,,,,,,,,,1,3,Dépendance,,0,,,,,,3.219045,49.61175
2023-15366,2023-03-16,000001,Vente,141100,8,,RUE DE LA CHAUSSEE,0270,02300,02173,Chauny,02,,,02173000AE0206,,,11,,,,,,,,,,1,3,Dépendance,,0,,,,,,3.219045,49.61175
2023-15366,2023-03-16,000001,Vente,141100,8,,RUE DE LA CHAUSSEE,0270,02300,02173,Chauny,02,,,02173000AE0206,,,5,,7,,,,,,,,2,2,Appartement,127,5,,,,,,3.219045,49.61175
2023-15366,2023-03-16,000001,Vente,141100,8,,RUE DE LA CHAUSSEE,0270,02300,02173,Chauny,02,,,02173000AE0206,,,5,,7,,,,,,,,2,3,Dépendance,,0,,,,,,3.219045,49.61175
2023-15454,2023-03-24,000001,Vente,244000,8,,AV QUENTIN DE LATOUR,1237,02300,02173,Chauny,02,,,02173000BC0348,,,,,,,,,,,,,0,1,Maison,105,3,S,sols,,,691,3.209678,49.626465
2023-15458,2023-03-24,000001,Vente,198000,37,B,RUE DU PORT,1200,02300,02173,Chauny,02,,,02173000AT0239,,,,,,,,,,,,,0,1,Maison,104,4,S,sols,,,412,3.21535,49.604355
2023-15491,2023-03-24,000001,Vente,104000,8,,RPT ALPHONSE MAUBANT,0031,02300,02173,Chauny,02,,,02173000AZ0243,,,,,,,,,,,,,0,3,Dépendance,,0,S,sols,,,407,3.212241,49.624082
2023-15491,2023-03-24,000001,Vente,104000,8,,RPT ALPHONSE MAUBANT,0031,02300,02173,Chauny,02,,,02173000AZ0243,,,,,,,,,,,,,0,1,Maison,80,5,S,sols,,,407,3.212241,49.624082
2023-15585,2023-03-22,000001,Vente,50000,112,,RUE DU BROUAGE,0210,02300,02173,Chauny,02,,,02173000AL0006,,,,,,,,,,,,,0,1,Maison,143,7,S,sols,,,143,3.207702,49.6144
2023-15653,2023-03-31,000001,Vente,85500,69,,RUE MAL DE LATTRE DE TASSIGNY,0958,02300,02173,Chauny,02,,,02173000AX0048,,,,,,,,,,,,,0,3,Dépendance,,0,S,sols,,,222,3.204631,49.61366
2023-15653,2023-03-31,000001,Vente,85500,69,,RUE MAL DE LATTRE DE TASSIGNY,0958,02300,02173,Chauny,02,,,02173000AX0048,,,,,,,,,,,,,0,3,Dépendance,,0,S,sols,,,222,3.204631,49.61366
2023-15653,2023-03-31,000001,Vente,85500,69,,RUE MAL DE LATTRE DE TASSIGNY,0958,02300,02173,Chauny,02,,,02173000AX0048,,,,,,,,,,,,,0,1,Maison,74,5,S,sols,,,222,3.204631,49.61366
2023-15653,2023-03-31,000001,Vente,85500,69,,RUE MAL DE LATTRE DE TASSIGNY,0958,02300,02173,Chauny,02,,,02173000AX0048,,,,,,,,,,,,,0,3,Dépendance,,0,S,sols,,,222,3.204631,49.61366
2023-15653,2023-03-31,000001,Vente,85500,69,,RUE MAL DE LATTRE DE TASSIGNY,0958,02300,02173,Chauny,02,,,02173000AX0048,,,,,,,,,,,,,0,3,Dépendance,,0,S,sols,,,222,3.204631,49.61366
2023-15661,2023-03-22,000001,Vente,23000,4,,RUE DES PIERRES,1170,02300,02173,Chauny,02,,,02173000AK0004,,,,,,,,,,,,,0,,,,,S,sols,,,305,3.216576,49.614889
2023-15666,2023-03-22,000001,Vente,96000,16,,RUE DE LA CITE FAVRESSE,0272,02300,02173,Chauny,02,,,02173000AX0138,,,,,,,,,,,,,0,1,Maison,56,3,S,sols,,,176,3.206945,49.612178
2023-15666,2023-03-22,000001,Vente,96000,16,,RUE DE LA CITE FAVRESSE,0272,02300,02173,Chauny,02,,,02173000AX0138,,,,,,,,,,,,,0,3,Dépendance,,0,S,sols,,,176,3.206945,49.612178
2023-15666,2023-03-22,000001,Vente,96000,18,,RUE DE LA CITE FAVRESSE,0272,02300,02173,Chauny,02,,,02173000AX0139,,,,,,,,,,,,,0,3,Dépendance,,0,S,sols,,,463,3.206861,49.612178
2023-15666,2023-03-22,000001,Vente,96000,18,,RUE DE LA CITE FAVRESSE,0272,02300,02173,Chauny,02,,,02173000AX0139,,,,,,,,,,,,,0,1,Maison,81,4,S,sols,,,463,3.206861,49.612178
2023-15666,2023-03-22,000001,Vente,96000,20,,RUE DE LA CITE FAVRESSE,0272,02300,02173,Chauny,02,,,02173000AX0140,,,,,,,,,,,,,0,,,,,J,jardins,,,994,3.206515,49.612173
2023-15666,2023-03-22,000001,Vente,96000,11,,RUE DE LA CITE FAVRESSE,0272,02300,02173,Chauny,02,,,02173000AX0143,,,,,,,,,,,,,0,,,,,PA,pâtures,,,495,3.206903,49.611669
2023-15666,2023-03-22,000001,Vente,96000,11,,RUE DE LA CITE FAVRESSE,0272,02300,02173,Chauny,02,,,02173000AX0143,,,,,,,,,,,,,0,,,,,J,jardins,,,875,3.206903,49.611669
2023-15673,2023-03-21,000001,Vente,115000,23,B,RUE PAUL DOUMER,1120,02300,02173,Chauny,02,,,02173000AP0463,,,45,,,,,,,,,,1,3,Dépendance,,0,,,,,,3.223317,49.617692
2023-15673,2023-03-21,000001,Vente,115000,23,B,RUE PAUL DOUMER,1120,02300,02173,Chauny,02,,,02173000AP0463,,,25,,,,,,,,,,1,2,Appartement,55,2,,,,,,3.223317,49.617692
2023-15674,2023-03-22,000001,Vente,43725,,,LA BELLE CROIX,B007,02300,02173,Chauny,02,,,02173000ZD0223,,,,,,,,,,,,,0,,,,,T,terres,,,742,3.229632,49.626734
2023-15674,2023-03-22,000001,Vente,43725,,,LA BELLE CROIX,B007,02300,02173,Chauny,02,,,02173000ZD0242,,,,,,,,,,,,,0,,,,,T,terres,,,53,3.229284,49.626744
2023-15675,2023-03-22,000001,Vente,4000,,,LES PRES NEUFS,B064,02300,02173,Chauny,02,,,02173000ZI0009,,,,,,,,,,,,,0,,,,,PA,pâtures,,,882,3.211529,49.6079
2023-15749,2023-03-24,000001,Vente,47000,10,,RUE GAY LUSSAC,0590,02300,02173,Chauny,02,,,02173000AZ0251,,,14,,,,,,,,,,1,2,Appartement,66,4,,,,,,3.210606,49.623601
2023-15749,2023-03-24,000001,Vente,47000,10,,RUE GAY LUSSAC,0590,02300,02173,Chauny,02,,,02173000AZ0251,,,14,,,,,,,,,,1,3,Dépendance,,0,,,,,,3.210606,49.623601
2023-15804,2023-04-04,000001,Vente,80000,102,,RUE GEO LUFBERY,0630,02300,02173,Chauny,02,,,02173000BO0029,,,,,,,,,,,,,0,3,Dépendance,,0,S,sols,,,492,3.239883,49.619957
2023-15804,2023-04-04,000001,Vente,80000,102,,RUE GEO LUFBERY,0630,02300,02173,Chauny,02,,,02173000BO0029,,,,,,,,,,,,,0,3,Dépendance,,0,S,sols,,,492,3.239883,49.619957
2023-15804,2023-04-04,000001,Vente,80000,102,,RUE GEO LUFBERY,0630,02300,02173,Chauny,02,,,02173000BO0029,,,,,,,,,,,,,0,1,Maison,85,5,S,sols,,,492,3.239883,49.619957
2023-16071,2023-03-31,000001,Vente,68000,6,,RUE VOLTAIRE,1470,02300,02173,Chauny,02,,,02173000AH0062,,,,,,,,,,,,,0,1,Maison,64,3,S,sols,,,64,3.22111,49.607928
2023-16137,2023-04-07,000001,Vente,40000,10,,RUE DU BROUAGE,0210,02300,02173,Chauny,02,,,02173000AL0153,,,,,,,,,,,,,0,1,Maison,59,4,S,sols,,,104,3.212275,49.614918
2023-16137,2023-04-07,000001,Vente,40000,10,,RUE DU BROUAGE,0210,02300,02173,Chauny,02,,,02173000AL0153,,,,,,,,,,,,,0,4,Local industriel. commercial ou assimilé,65,0,S,sols,,,104,3.212275,49.614918
2023-16137,2023-04-07,000001,Vente,40000,10,,RUE DU BROUAGE,0210,02300,02173,Chauny,02,,,02173000AL0153,,,,,,,,,,,,,0,3,Dépendance,,0,S,sols,,,104,3.212275,49.614918
2023-16231,2023-04-17,000001,Vente,125000,64,,RUE JEAN DE LA FONTAINE,0760,02300,02173,Chauny,02,,,02173000AW0120,,,,,,,,,,,,,0,3,Dépendance,,0,S,sols,,,86,3.215107,49.608728
2023-16231,2023-04-17,000001,Vente,125000,64,,RUE JEAN DE LA FONTAINE,0760,02300,02173,Chauny,02,,,02173000AW0120,,,,,,,,,,,,,0,1,Maison,76,5,S,sols,,,86,3.215107,49.608728
2023-16306,2023-04-05,000002,Vente,100000,3,,RUE DE LA PAIX,1090,02300,02173,Chauny,02,,,02173000AB0250,,,,,,,,,,,,,0,,,,,S,sols,,,160,3.218931,49.616
2023-16429,2023-04-24,000001,Vente,23000,90,,RUE DE LA CONVENTION,0330,02300,02173,Chauny,02,,,02173000AW0100,,,,,,,,,,,,,0,1,Maison,38,2,S,sols,,,124,3.214164,49.61008
2023-16435,2023-04-28,000001,Vente,64000,8,,RUE GANTON,0580,02300,02173,Chauny,02,,,02173000AM0210,,,,,,,,,,,,,0,1,Maison,61,4,S,sols,,,111,3.213466,49.615405
2023-16448,2023-04-28,000001,Vente,55000,20,,RUE MINARD,1000,02300,02173,Chauny,02,,,02173000AB0099,,,,,,,,,,,,,0,1,Maison,58,3,S,sols,,,58,3.221594,49.616229
2023-16461,2023-04-28,000001,Vente,65000,138,B,RUE PASTEUR,1110,02300,02173,Chauny,02,,,02173000AP0202,,,,,,,,,,,,,0,1,Maison,77,5,S,sols,,,190,3.225678,49.621028
2023-16672,2023-04-19,000001,Vente,175715,18,,RUE EMILE ZOLA,0460,02300,02173,Chauny,02,,,02173000AE0253,,,16,,,,,,,,,,1,2,Appartement,75,3,,,,,,3.217098,49.611215
2023-16678,2023-05-03,000001,Vente,64400,10,,RUE GAY LUSSAC,0590,02300,02173,Chauny,02,,,02173000AZ0251,,,18,,,,,,,,,,1,3,Dépendance,,0,,,,,,3.210606,49.623601
2023-16678,2023-05-03,000001,Vente,64400,10,,RUE GAY LUSSAC,0590,02300,02173,Chauny,02,,,02173000AZ0251,,,18,,,,,,,,,,1,2,Appartement,78,5,,,,,,3.210606,49.623601
2023-16778,2023-04-27,000001,Vente,110000,161,,AV JEAN JAURES,0780,02300,02173,Chauny,02,,,02173000BN0179,,,,,,,,,,,,,0,1,Maison,65,3,J,jardins,,,284,3.234348,49.618661
2023-16778,2023-04-27,000001,Vente,110000,161,,AV JEAN JAURES,0780,02300,02173,Chauny,02,,,02173000BN0179,,,,,,,,,,,,,0,1,Maison,65,3,S,sols,,,265,3.234348,49.618661
2023-16778,2023-04-27,000001,Vente,110000,161,,AV JEAN JAURES,0780,02300,02173,Chauny,02,,,02173000BN0179,,,,,,,,,,,,,0,3,Dépendance,,0,J,jardins,,,284,3.234348,49.618661
2023-16778,2023-04-27,000001,Vente,110000,161,,AV JEAN JAURES,0780,02300,02173,Chauny,02,,,02173000BN0179,,,,,,,,,,,,,0,3,Dépendance,,0,S,sols,,,265,3.234348,49.618661
2023-16778,2023-04-27,000001,Vente,110000,161,,AV JEAN JAURES,0780,02300,02173,Chauny,02,,,02173000BN0179,,,,,,,,,,,,,0,3,Dépendance,,0,S,sols,,,265,3.234348,49.618661