id_mutation,date_mutation,numero_disposition,nature_mutation,valeur_fonciere,adresse_numero,adresse_suffixe,adresse_nom_voie,adresse_code_voie,code_postal,code_commune,nom_commune,code_departement,ancien_code_commune,ancien_nom_commune,id_parcelle,ancien_id_parcelle,numero_volume,lot1_numero,lot1_surface_carrez,lot2_numero,lot2_surface_carrez,lot3_numero,lot3_surface_carrez,lot4_numero,lot4_surface_carrez,lot5_numero,lot5_surface_carrez,nombre_lots,code_type_local,type_local,surface_reelle_bati,nombre_pieces_principales,code_nature_culture,nature_culture,code_nature_culture_speciale,nature_culture_speciale,surface_terrain,longitude,latitude
2023-24729,2023-02-23,000001,Vente,39000,,,LA GRANDE PIECE,B082,03350,03150,Louroux-Bourbonnais,03,,,03150000AL0063,,,,,,,,,,,,,0,,,,,T,terres,,,6337,2.789657,46.526234
2023-24729,2023-02-23,000001,Vente,39000,,,LA GRANDE PIECE,B082,03350,03150,Louroux-Bourbonnais,03,,,03150000AL0064,,,,,,,,,,,,,0,,,,,T,terres,,,3718,2.791127,46.526851
2023-24729,2023-02-23,000001,Vente,39000,,,LA GRANDE PIECE,B082,03350,03150,Louroux-Bourbonnais,03,,,03150000AL0067,,,,,,,,,,,,,0,,,,,P,prés,,,6027,2.790274,46.528508
2023-24729,2023-02-23,000001,Vente,39000,,,LA GRANDE PIECE,B082,03350,03150,Louroux-Bourbonnais,03,,,03150000AL0068,,,,,,,,,,,,,0,,,,,T,terres,,,2996,2.791775,46.528694
2023-24729,2023-02-23,000001,Vente,39000,,,LA GRANDE PIECE,B082,03350,03150,Louroux-Bourbonnais,03,,,03150000AL0069,,,,,,,,,,,,,0,,,,,P,prés,,,3541,2.791454,46.528991
2023-24729,2023-02-23,000001,Vente,39000,,,LA GRANDE PIECE,B082,03350,03150,Louroux-Bourbonnais,03,,,03150000AL0070,,,,,,,,,,,,,0,,,,,S,sols,,,230,2.79232,46.529314
2023-24729,2023-02-23,000001,Vente,39000,,,LA ROUCHE,B127,03350,03150,Louroux-Bourbonnais,03,,,03150000AL0112,,,,,,,,,,,,,0,,,,,T,terres,,,10400,2.791392,46.521997
2023-24729,2023-02-23,000001,Vente,39000,,,LA ROUCHE,B127,03350,03150,Louroux-Bourbonnais,03,,,03150000AL0113,,,,,,,,,,,,,0,,,,,T,terres,,,8631,2.791478,46.520849
2023-24729,2023-02-23,000001,Vente,39000,,,LA ROUCHE,B127,03350,03150,Louroux-Bourbonnais,03,,,03150000AL0114,,,,,,,,,,,,,0,,,,,T,terres,,,11276,2.790382,46.520628
2023-24729,2023-02-23,000001,Vente,39000,,,LA ROUCHE,B127,03350,03150,Louroux-Bourbonnais,03,,,03150000AL0115,,,,,,,,,,,,,0,,,,,T,terres,,,1412,2.789238,46.521097
2023-24729,2023-02-23,000001,Vente,39000,,,LA TREMBLEE,B138,03350,03150,Louroux-Bourbonnais,03,,,03150000AL0128,,,,,,,,,,,,,0,,,,,T,terres,,,1713,2.784102,46.522059
2023-24729,2023-02-23,000001,Vente,39000,,,AGRIPTIERE,B001,03350,03150,Louroux-Bourbonnais,03,,,03150000AL0129,,,,,,,,,,,,,0,,,,,P,prés,,,3527,2.783891,46.522265
2023-24729,2023-02-23,000001,Vente,39000,,,AGRIPTIERE,B001,03350,03150,Louroux-Bourbonnais,03,,,03150000AL0130,,,,,,,,,,,,,0,,,,,T,terres,,,2354,2.784472,46.522326
2023-24729,2023-02-23,000001,Vente,39000,,,AGRIPTIERE,B001,03350,03150,Louroux-Bourbonnais,03,,,03150000AL0139,,,,,,,,,,,,,0,,,,,T,terres,,,4193,2.784342,46.523169
2023-24729,2023-02-23,000001,Vente,39000,,,LA ROUCHE,B127,03350,03150,Louroux-Bourbonnais,03,,,03150000AL0158,,,,,,,,,,,,,0,,,,,T,terres,,,9605,2.789246,46.520653
2023-25272,2023-04-03,000001,Vente,258750,,,LES FLOQUETS,B066,03350,03150,Louroux-Bourbonnais,03,,,031500000E0241,,,,,,,,,,,,,0,,,,,T,terres,,,22694,2.827781,46.518534
2023-25272,2023-04-03,000001,Vente,258750,,,LES FLOQUETS,B066,03350,03150,Louroux-Bourbonnais,03,,,031500000E0242,,,,,,,,,,,,,0,,,,,P,prés,,,9910,2.828236,46.519622
2023-25272,2023-04-03,000001,Vente,258750,,,LES FLOQUETS,B066,03350,03150,Louroux-Bourbonnais,03,,,031500000E0242,,,,,,,,,,,,,0,,,,,P,prés,,,9909,2.828236,46.519622
2023-25272,2023-04-03,000001,Vente,258750,,,LES FLOQUETS,B066,03350,03150,Louroux-Bourbonnais,03,,,031500000E0243,,,,,,,,,,,,,0,,,,,P,prés,,,18583,2.82733,46.521114
2023-25272,2023-04-03,000001,Vente,258750,,,LES FLOQUETS,B066,03350,03150,Louroux-Bourbonnais,03,,,031500000E0243,,,,,,,,,,,,,0,,,,,P,prés,,,18583,2.82733,46.521114
2023-25272,2023-04-03,000001,Vente,258750,5145,,LES FLOQUETS,B066,03350,03150,Louroux-Bourbonnais,03,,,031500000E0244,,,,,,,,,,,,,0,3,Dépendance,,0,S,sols,,,3881,2.826027,46.520622
2023-25272,2023-04-03,000001,Vente,258750,5145,,LES FLOQUETS,B066,03350,03150,Louroux-Bourbonnais,03,,,031500000E0244,,,,,,,,,,,,,0,1,Maison,105,4,S,sols,,,3881,2.826027,46.520622
2023-25272,2023-04-03,000001,Vente,258750,,,LES FLOQUETS,B066,03350,03150,Louroux-Bourbonnais,03,,,031500000E0245,,,,,,,,,,,,,0,,,,,T,terres,,,12227,2.825378,46.521351
2023-25272,2023-04-03,000001,Vente,258750,,,LES FLOQUETS,B066,03350,03150,Louroux-Bourbonnais,03,,,031500000E0245,,,,,,,,,,,,,0,,,,,T,terres,,,6114,2.825378,46.521351
2023-25272,2023-04-03,000001,Vente,258750,,,LES FLOQUETS,B066,03350,03150,Louroux-Bourbonnais,03,,,031500000E0246,,,,,,,,,,,,,0,,,,,P,prés,,,7957,2.825381,46.520362
2023-25272,2023-04-03,000001,Vente,258750,,,LES FLOQUETS,B066,03350,03150,Louroux-Bourbonnais,03,,,031500000E0248,,,,,,,,,,,,,0,,,,,T,terres,,,7331,2.823378,46.519953
2023-25272,2023-04-03,000001,Vente,258750,,,LES CAMPAGNES,B027,03350,03150,Louroux-Bourbonnais,03,,,031500000E0266,,,,,,,,,,,,,0,,,,,T,terres,,,6980,2.821899,46.520069
2023-25272,2023-04-03,000001,Vente,258750,,,LES CAMPAGNES,B027,03350,03150,Louroux-Bourbonnais,03,,,031500000E0266,,,,,,,,,,,,,0,,,,,T,terres,,,6979,2.821899,46.520069
2023-25272,2023-04-03,000001,Vente,258750,,,BORD,B012,03350,03150,Louroux-Bourbonnais,03,,,031500000E0271,,,,,,,,,,,,,0,,,,,BT,taillis simples,,,1120,2.825209,46.521761
2023-25272,2023-04-03,000001,Vente,258750,,,BORD,B012,03350,03150,Louroux-Bourbonnais,03,,,031500000E0272,,,,,,,,,,,,,0,,,,,P,prés,,,2911,2.826012,46.521993
2023-25272,2023-04-03,000001,Vente,258750,,,BORD,B012,03350,03150,Louroux-Bourbonnais,03,,,031500000E0274,,,,,,,,,,,,,0,,,,,P,prés,,,7569,2.826143,46.522697
2023-25272,2023-04-03,000001,Vente,258750,,,BORD,B012,03350,03150,Louroux-Bourbonnais,03,,,031500000E0275,,,,,,,,,,,,,0,,,,,BT,taillis simples,,,873,2.825402,46.523902
2023-25428,2023-03-24,000001,Vente,25000,,,LE BOURG,B015,03350,03150,Louroux-Bourbonnais,03,,,03150000AI0168,,,,,,,,,,,,,0,,,,,P,prés,,,4919,2.838987,46.532354
2023-25428,2023-03-24,000001,Vente,25000,,,LE BOURG,B015,03350,03150,Louroux-Bourbonnais,03,,,03150000AI0169,,,,,,,,,,,,,0,,,,,S,sols,,,1403,2.838365,46.532532
2023-27826,2023-07-04,000001,Vente,59750,5042,,LE BOURG,B015,03350,03150,Louroux-Bourbonnais,03,,,03150000AI0108,,,,,,,,,,,,,0,1,Maison,160,4,S,sols,,,434,2.841073,46.535767
2023-27826,2023-07-04,000001,Vente,59750,5042,,LE BOURG,B015,03350,03150,Louroux-Bourbonnais,03,,,03150000AI0108,,,,,,,,,,,,,0,3,Dépendance,,0,S,sols,,,434,2.841073,46.535767
2023-27826,2023-07-04,000001,Vente,59750,5042,,LE BOURG,B015,03350,03150,Louroux-Bourbonnais,03,,,03150000AI0108,,,,,,,,,,,,,0,3,Dépendance,,0,S,sols,,,434,2.841073,46.535767
2023-29160,2023-09-18,000001,Vente,26000,5173,,LA LONGE,B093,03350,03150,Louroux-Bourbonnais,03,,,03150000AL0006,,,,,,,,,,,,,0,3,Dépendance,,0,S,sols,,,174,2.779122,46.527626
2023-29160,2023-09-18,000001,Vente,26000,5173,,LA LONGE,B093,03350,03150,Louroux-Bourbonnais,03,,,03150000AL0006,,,,,,,,,,,,,0,1,Maison,65,3,S,sols,,,174,2.779122,46.527626
2023-29160,2023-09-18,000001,Vente,26000,,,LA LONGE,B093,03350,03150,Louroux-Bourbonnais,03,,,03150000AL0007,,,,,,,,,,,,,0,,,,,J,jardins,,,310,2.779192,46.527499
2023-30444,2023-11-02,000001,Vente,32250,5175,A,LES BLAINS,B004,03350,03150,Louroux-Bourbonnais,03,,,03150000AO0024,,,,,,,,,,,,,0,3,Dépendance,,0,S,sols,,,1000,2.771021,46.517643
2023-30444,2023-11-02,000001,Vente,32250,5175,A,LES BLAINS,B004,03350,03150,Louroux-Bourbonnais,03,,,03150000AO0024,,,,,,,,,,,,,0,3,Dépendance,,0,E,eaux,ETANG,Etangs,4151,2.771021,46.517643
2023-30444,2023-11-02,000001,Vente,32250,5175,A,LES BLAINS,B004,03350,03150,Louroux-Bourbonnais,03,,,03150000AO0024,,,,,,,,,,,,,0,3,Dépendance,,0,L,landes,,,1680,2.771021,46.517643
2023-30444,2023-11-02,000001,Vente,32250,5175,A,LES BLAINS,B004,03350,03150,Louroux-Bourbonnais,03,,,03150000AO0024,,,,,,,,,,,,,0,3,Dépendance,,0,P,prés,,,1320,2.771021,46.517643
2023-30444,2023-11-02,000001,Vente,32250,,,LES BLAINS,B004,03350,03150,Louroux-Bourbonnais,03,,,03150000AO0043,,,,,,,,,,,,,0,,,,,L,landes,,,330,2.770885,46.517674
2023-30444,2023-11-02,000001,Vente,32250,,,LES BLAINS,B004,03350,03150,Louroux-Bourbonnais,03,,,03150000AO0043,,,,,,,,,,,,,0,,,,,E,eaux,ETANG,Etangs,1470,2.770885,46.517674
2023-30736,2023-11-24,000001,Vente,43500,5183,,LE BOURG,B015,03350,03150,Louroux-Bourbonnais,03,,,03150000AI0024,,,,,,,,,,,,,0,1,Maison,90,2,S,sols,,,136,2.839926,46.536726
2023-30736,2023-11-24,000001,Vente,43500,,,LE BOURG,B015,03350,03150,Louroux-Bourbonnais,03,,,03150000AI0186,,,,,,,,,,,,,0,,,,,S,sols,,,60,2.839887,46.536706
2023-30769,2023-11-30,000001,Vente,145000,,,BRUYERE DE LAUME,B019,03350,03150,Louroux-Bourbonnais,03,,,03150000AC0033,,,,,,,,,,,,,0,,,,,P,prés,,,10191,2.836585,46.563164
2023-30769,2023-11-30,000001,Vente,145000,,,LAUME,B091,03350,03150,Louroux-Bourbonnais,03,,,031500000C0211,,,,,,,,,,,,,0,,,,,BS,taillis sous futaie,,,1176,2.834866,46.564156
