id_mutation,date_mutation,numero_disposition,nature_mutation,valeur_fonciere,adresse_numero,adresse_suffixe,adresse_nom_voie,adresse_code_voie,code_postal,code_commune,nom_commune,code_departement,ancien_code_commune,ancien_nom_commune,id_parcelle,ancien_id_parcelle,numero_volume,lot1_numero,lot1_surface_carrez,lot2_numero,lot2_surface_carrez,lot3_numero,lot3_surface_carrez,lot4_numero,lot4_surface_carrez,lot5_numero,lot5_surface_carrez,nombre_lots,code_type_local,type_local,surface_reelle_bati,nombre_pieces_principales,code_nature_culture,nature_culture,code_nature_culture_speciale,nature_culture_speciale,surface_terrain,longitude,latitude
2023-27420,2023-07-05,000001,Vente,185000,689,,RTE DE DECIZE,0055,03230,03245,Saint-Martin-des-Lais,03,,,03245000AR0122,,,,,,,,,,,,,0,1,Maison,132,4,J,jardins,,,935,3.641143,46.659182
2023-27420,2023-07-05,000001,Vente,185000,689,,RTE DE DECIZE,0055,03230,03245,Saint-Martin-des-Lais,03,,,03245000AR0122,,,,,,,,,,,,,0,1,Maison,132,4,S,sols,,,1300,3.641143,46.659182
2023-29641,2023-09-14,000002,Vente,70000,,,LES BRUNS,B016,03230,03245,Saint-Martin-des-Lais,03,,,03245000AN0032,,,,,,,,,,,,,0,,,,,S,sols,,,285,3.667073,46.653334
2023-29641,2023-09-14,000002,Vente,70000,,,LES BRUNS,B016,03230,03245,Saint-Martin-des-Lais,03,,,03245000AN0053,,,,,,,,,,,,,0,,,,,S,sols,,,1321,3.667571,46.653102
2023-29660,2023-09-14,000001,Vente,260000,5018,,LES BRUNS,B016,03230,03245,Saint-Martin-des-Lais,03,,,03245000AN0054,,,,,,,,,,,,,0,1,Maison,138,5,,,,,,3.666814,46.652645
2023-29660,2023-09-14,000001,Vente,260000,5018,,LES BRUNS,B016,03230,03245,Saint-Martin-des-Lais,03,,,03245000AN0054,,,,,,,,,,,,,0,1,Maison,135,5,,,,,,3.666814,46.652645
2023-29660,2023-09-14,000001,Vente,260000,5018,,LES BRUNS,B016,03230,03245,Saint-Martin-des-Lais,03,,,03245000AN0054,,,,,,,,,,,,,0,3,Dépendance,,0,,,,,,3.666814,46.652645
2023-29660,2023-09-14,000001,Vente,260000,5018,,LES BRUNS,B016,03230,03245,Saint-Martin-des-Lais,03,,,03245000AN0054,,,,,,,,,,,,,0,3,Dépendance,,0,,,,,,3.666814,46.652645
2023-30258,2023-10-27,000001,Vente,34000,133,,RTE DES BRUNS,0030,03230,03245,Saint-Martin-des-Lais,03,,,03245000AI0016,,,,,,,,,,,,,0,3,Dépendance,,0,S,sols,,,505,3.656329,46.667996
2023-30258,2023-10-27,000001,Vente,34000,133,,RTE DES BRUNS,0030,03230,03245,Saint-Martin-des-Lais,03,,,03245000AI0016,,,,,,,,,,,,,0,1,Maison,115,6,S,sols,,,505,3.656329,46.667996
