id_mutation,date_mutation,numero_disposition,nature_mutation,valeur_fonciere,adresse_numero,adresse_suffixe,adresse_nom_voie,adresse_code_voie,code_postal,code_commune,nom_commune,code_departement,ancien_code_commune,ancien_nom_commune,id_parcelle,ancien_id_parcelle,numero_volume,lot1_numero,lot1_surface_carrez,lot2_numero,lot2_surface_carrez,lot3_numero,lot3_surface_carrez,lot4_numero,lot4_surface_carrez,lot5_numero,lot5_surface_carrez,nombre_lots,code_type_local,type_local,surface_reelle_bati,nombre_pieces_principales,code_nature_culture,nature_culture,code_nature_culture_speciale,nature_culture_speciale,surface_terrain,longitude,latitude
2023-78092,2023-01-10,000001,Vente,5900,,,LA FABREGE,B036,07460,07211,Saint-André-de-Cruzières,07,,,072110000A0940,,,,,,,,,,,,,0,,,,,P,prés,,,4200,4.21832,44.319934
2023-78092,2023-01-10,000001,Vente,5900,,,CHAMPARAS,B017,07460,07211,Saint-André-de-Cruzières,07,,,072110000D0270,,,,,,,,,,,,,0,,,,,VI,vignes,,,3500,4.232046,44.302866
2023-78092,2023-01-10,000001,Vente,5900,,,CHAMPARAS,B017,07460,07211,Saint-André-de-Cruzières,07,,,072110000D0270,,,,,,,,,,,,,0,,,,,VI,vignes,,,3500,4.232046,44.302866
2023-78092,2023-01-10,000001,Vente,5900,,,CHAMPARAS,B017,07460,07211,Saint-André-de-Cruzières,07,,,072110000D0271,,,,,,,,,,,,,0,,,,,VI,vignes,,,2980,4.23278,44.302386
2023-78092,2023-01-10,000001,Vente,5900,,,CHAMPARAS,B017,07460,07211,Saint-André-de-Cruzières,07,,,072110000D0272,,,,,,,,,,,,,0,,,,,VI,vignes,,,2320,4.232947,44.303102
2023-78092,2023-01-10,000001,Vente,5900,,,CHAMPARAS,B017,07460,07211,Saint-André-de-Cruzières,07,,,072110000D0274,,,,,,,,,,,,,0,,,,,VI,vignes,,,1440,4.232835,44.30342
2023-78092,2023-01-10,000001,Vente,5900,,,LES GALIGNIERES,B045,07460,07211,Saint-André-de-Cruzières,07,,,072110000D0359,,,,,,,,,,,,,0,,,,,VI,vignes,,,1550,4.225953,44.304183
2023-78092,2023-01-10,000001,Vente,5900,,,LES GALIGNIERES,B045,07460,07211,Saint-André-de-Cruzières,07,,,072110000D0359,,,,,,,,,,,,,0,,,,,VI,vignes,,,1550,4.225953,44.304183
2023-78092,2023-01-10,000001,Vente,5900,,,LES GALIGNIERES,B045,07460,07211,Saint-André-de-Cruzières,07,,,072110000D0359,,,,,,,,,,,,,0,,,,,S,sols,,,500,4.225953,44.304183
2023-78092,2023-01-10,000001,Vente,5900,,,LES GALIGNIERES,B045,07460,07211,Saint-André-de-Cruzières,07,,,072110000D0365,,,,,,,,,,,,,0,,,,,VI,vignes,,,370,4.225483,44.304335
2023-78092,2023-01-10,000001,Vente,5900,,,LES GALIGNIERES,B045,07460,07211,Saint-André-de-Cruzières,07,,,072110000D0368,,,,,,,,,,,,,0,,,,,L,landes,,,1050,4.22359,44.304826
2023-78092,2023-01-10,000001,Vente,5900,,,LES GALIGNIERES,B045,07460,07211,Saint-André-de-Cruzières,07,,,072110000D0369,,,,,,,,,,,,,0,,,,,L,landes,,,1230,4.223776,44.304693
2023-78092,2023-01-10,000001,Vente,5900,,,LES GALIGNIERES,B045,07460,07211,Saint-André-de-Cruzières,07,,,072110000D0370,,,,,,,,,,,,,0,,,,,T,terres,,,840,4.224234,44.304696
2023-78092,2023-01-10,000001,Vente,5900,,,LES GALIGNIERES,B045,07460,07211,Saint-André-de-Cruzières,07,,,072110000D0371,,,,,,,,,,,,,0,,,,,T,terres,,,920,4.224603,44.304388
2023-78092,2023-01-10,000001,Vente,5900,,,LES GALIGNIERES,B045,07460,07211,Saint-André-de-Cruzières,07,,,072110000D0372,,,,,,,,,,,,,0,,,,,L,landes,,,5360,4.223911,44.304282
2023-78092,2023-01-10,000001,Vente,5900,,,LES GALIGNIERES,B045,07460,07211,Saint-André-de-Cruzières,07,,,072110000D0373,,,,,,,,,,,,,0,,,,,L,landes,,,520,4.223232,44.303956
2023-78092,2023-01-10,000001,Vente,5900,,,LES GALIGNIERES,B045,07460,07211,Saint-André-de-Cruzières,07,,,072110000D0374,,,,,,,,,,,,,0,,,,,VI,vignes,,,3040,4.22304,44.304365
2023-78092,2023-01-10,000001,Vente,5900,,,LES GALIGNIERES,B045,07460,07211,Saint-André-de-Cruzières,07,,,072110000D0375,,,,,,,,,,,,,0,,,,,VI,vignes,,,1645,4.223005,44.304831
2023-78092,2023-01-10,000001,Vente,5900,,,LE RANCHAS,B068,07460,07211,Saint-André-de-Cruzières,07,,,072110000D0670,,,,,,,,,,,,,0,,,,,L,landes,,,1245,4.220307,44.303262
2023-78092,2023-01-10,000001,Vente,5900,,,LE RANCHAS,B068,07460,07211,Saint-André-de-Cruzières,07,,,072110000D0671,,,,,,,,,,,,,0,,,,,VI,vignes,,,2250,4.22089,44.303468
2023-78092,2023-01-10,000001,Vente,5900,,,L ESPAROT,B035,07460,07211,Saint-André-de-Cruzières,07,,,072110000D0683,,,,,,,,,,,,,0,,,,,VI,vignes,,,4050,4.221117,44.303359
2023-78092,2023-01-10,000001,Vente,5900,,,L ESPAROT,B035,07460,07211,Saint-André-de-Cruzières,07,,,072110000D0728,,,,,,,,,,,,,0,,,,,VI,vignes,,,750,4.229023,44.3008
2023-78092,2023-01-10,000001,Vente,5900,,,L ESPAROT,B035,07460,07211,Saint-André-de-Cruzières,07,,,072110000D0729,,,,,,,,,,,,,0,,,,,VI,vignes,,,3850,4.229371,44.300573
2023-78092,2023-01-10,000001,Vente,5900,,,LA JUSTARELLE,B048,07460,07211,Saint-André-de-Cruzières,07,,,072110000D0763,,,,,,,,,,,,,0,,,,,L,landes,,,2650,4.222881,44.296597
2023-78092,2023-01-10,000001,Vente,5900,,,CHAMPARAS,B017,07460,07211,Saint-André-de-Cruzières,07,,,072110000D0827,,,,,,,,,,,,,0,,,,,L,landes,,,6000,4.231748,44.301624
2023-78092,2023-01-10,000001,Vente,5900,,,LES GALIGNIERES,B045,07460,07211,Saint-André-de-Cruzières,07,,,072110000D0858,,,,,,,,,,,,,0,,,,,L,landes,,,4560,4.224157,44.303819
2023-78092,2023-01-10,000001,Vente,5900,,,LE RANCHAS,B068,07460,07211,Saint-André-de-Cruzières,07,,,072110000D0864,,,,,,,,,,,,,0,,,,,VE,vergers,OLIVE,Oliveraie ou oliviers,400,4.221499,44.303765
2023-78143,2023-01-18,000001,Vente,1500,,,LA CHARBONNIERE,B018,07460,07211,Saint-André-de-Cruzières,07,,,072110000A0020,,,,,,,,,,,,,0,,,,,L,landes,,,3600,4.200029,44.334048
2023-78143,2023-01-18,000001,Vente,1500,,,LA FERROUILLE,B038,07460,07211,Saint-André-de-Cruzières,07,,,072110000B0436,,,,,,,,,,,,,0,,,,,L,landes,,,10300,4.238694,44.325421
2023-78143,2023-01-18,000001,Vente,1500,,,LE SERRE,B070,07460,07211,Saint-André-de-Cruzières,07,,,072110000B0781,,,,,,,,,,,,,0,,,,,L,landes,,,4520,4.234929,44.309102
2023-78143,2023-01-18,000001,Vente,1500,,,LES ABRITS,B001,07460,07211,Saint-André-de-Cruzières,07,,,072110000C0882,,,,,,,,,,,,,0,,,,,L,landes,,,400,4.197926,44.307531
2023-79267,2023-02-24,000002,Vente,3280,,,LA FABREGE,B036,07460,07211,Saint-André-de-Cruzières,07,,,072110000A1527,,,,,,,,,,,,,0,,,,,L,landes,,,328,4.215495,44.317524
2023-79331,2023-03-16,000001,Vente,150000,,,LE MOULIN,B054,07460,07211,Saint-André-de-Cruzières,07,,,072110000D0216,,,,,,,,,,,,,0,,,,,T,terres,,,3870,4.222817,44.309099
2023-79331,2023-03-16,000001,Vente,150000,,,LE MOULIN,B054,07460,07211,Saint-André-de-Cruzières,07,,,072110000D0217,,,,,,,,,,,,,0,,,,,S,sols,,,220,4.223037,44.309325
2023-79349,2023-03-16,000001,Vente,210100,355,,CHE VINCENT MALIGNON,0171,07460,07211,Saint-André-de-Cruzières,07,,,072110000B0915,,,,,,,,,,,,,0,1,Maison,140,3,S,sols,,,120,4.223045,44.309476
2023-79349,2023-03-16,000001,Vente,210100,,,PICHEGRU,B059,07460,07211,Saint-André-de-Cruzières,07,,,072110000B0916,,,,,,,,,,,,,0,,,,,T,terres,,,920,4.223051,44.3096
2023-80009,2023-03-28,000001,Vente,1600,5337,,SAINT ANDRE,B069,07460,07211,Saint-André-de-Cruzières,07,,,072110000B1053,,,1,,,,,,,,,,1,3,Dépendance,,0,,,,,,4.21579,44.313494
2023-80063,2023-04-14,000001,Vente,41000,,,LA PEIRILLE,B056,07460,07211,Saint-André-de-Cruzières,07,,,072110000D0931,,,,,,,,,,,,,0,,,,,T,terres,,,131,4.212261,44.306247
2023-80063,2023-04-14,000001,Vente,41000,,,LA PEIRILLE,B056,07460,07211,Saint-André-de-Cruzières,07,,,072110000D0934,,,,,,,,,,,,,0,,,,,T,terres,,,1081,4.212081,44.306279
2023-80082,2023-04-11,000001,Vente,3700,,,LA COURNAREDE,B030,07460,07211,Saint-André-de-Cruzières,07,,,072110000C1104,,,,,,,,,,,,,0,,,,,BT,taillis simples,,,10760,4.199935,44.305234
2023-80082,2023-04-11,000001,Vente,3700,,,LA COURNAREDE,B030,07460,07211,Saint-André-de-Cruzières,07,,,072110000C1105,,,,,,,,,,,,,0,,,,,BT,taillis simples,,,3920,4.199992,44.305708
2023-80144,2023-04-19,000001,Vente,47000,,,CREUSE SAUT,B032,07460,07211,Saint-André-de-Cruzières,07,,,072110000A0530,,,,,,,,,,,,,0,,,,,VE,vergers,OLIVE,Oliveraie ou oliviers,1200,4.20966,44.324172
2023-80144,2023-04-19,000001,Vente,47000,,,CREUSE SAUT,B032,07460,07211,Saint-André-de-Cruzières,07,,,072110000A0531,,,,,,,,,,,,,0,,,,,VE,vergers,OLIVE,Oliveraie ou oliviers,950,4.209978,44.324217
2023-80144,2023-04-19,000001,Vente,47000,,,CREUSE SAUT,B032,07460,07211,Saint-André-de-Cruzières,07,,,072110000A0532,,,,,,,,,,,,,0,,,,,VE,vergers,OLIVE,Oliveraie ou oliviers,2700,4.210173,44.32449
2023-80144,2023-04-19,000001,Vente,47000,,,CREUSE SAUT,B032,07460,07211,Saint-André-de-Cruzières,07,,,072110000A0535,,,,,,,,,,,,,0,,,,,VE,vergers,OLIVE,Oliveraie ou oliviers,1800,4.21051,44.324216
2023-80144,2023-04-19,000001,Vente,47000,,,CREUSE SAUT,B032,07460,07211,Saint-André-de-Cruzières,07,,,072110000A0535,,,,,,,,,,,,,0,,,,,T,terres,,,1800,4.21051,44.324216
2023-80144,2023-04-19,000001,Vente,47000,,,CREUSE SAUT,B032,07460,07211,Saint-André-de-Cruzières,07,,,072110000A0536,,,,,,,,,,,,,0,,,,,L,landes,,,1000,4.210577,44.324105
2023-80762,2023-05-02,000001,Vente,192600,5,,RUE DE LA COCALIERE,0048,07460,07211,Saint-André-de-Cruzières,07,,,072110000C0291,,,,,,,,,,,,,0,1,Maison,105,5,S,sols,,,190,4.197485,44.319593
2023-80762,2023-05-02,000001,Vente,192600,5,,RUE DE LA COCALIERE,0048,07460,07211,Saint-André-de-Cruzières,07,,,072110000C0291,,,,,,,,,,,,,0,3,Dépendance,,0,S,sols,,,190,4.197485,44.319593
2023-80762,2023-05-02,000001,Vente,192600,,,LE PUIT DE MALIGNON,B067,07460,07211,Saint-André-de-Cruzières,07,,,072110000C1200,,,,,,,,,,,,,0,,,,,S,sols,,,71,4.197452,44.319521
2023-81687,2023-06-09,000001,Vente,400,,,CARISSOULE,B012,07460,07211,Saint-André-de-Cruzières,07,,,072110000A0409,,,,,,,,,,,,,0,,,,,L,landes,,,12800,4.184813,44.322385
2023-81700,2023-06-05,000001,Vente,15000,,,LES FOURNAS,B042,07460,07211,Saint-André-de-Cruzières,07,,,072110000C1031,,,,,,,,,,,,,0,,,,,BT,taillis simples,,,2685,4.193451,44.302683
2023-81700,2023-06-05,000001,Vente,15000,,,LES FOURNAS,B042,07460,07211,Saint-André-de-Cruzières,07,,,072110000C1031,,,,,,,,,,,,,0,,,,,BT,taillis simples,,,2685,4.193451,44.302683
2023-81700,2023-06-05,000001,Vente,15000,,,LES FOURNAS,B042,07460,07211,Saint-André-de-Cruzières,07,,,072110000C1056,,,,,,,,,,,,,0,,,,,L,landes,,,25340,4.190362,44.29864
2023-81700,2023-06-05,000001,Vente,15000,,,LES FOURNAS,B042,07460,07211,Saint-André-de-Cruzières,07,,,072110000C1057,,,,,,,,,,,,,0,,,,,L,landes,,,7560,4.191175,44.299178
2023-81700,2023-06-05,000001,Vente,15000,,,LE CLOS DE LA GRANGE,B026,07460,07211,Saint-André-de-Cruzières,07,,,072110000C1058,,,,,,,,,,,,,0,,,,,L,landes,,,35620,4.192704,44.29829
2023-81700,2023-06-05,000001,Vente,15000,,,LE CLOS DE LA GRANGE,B026,07460,07211,Saint-André-de-Cruzières,07,,,072110000C1067,,,,,,,,,,,,,0,,,,,BT,taillis simples,,,53800,4.193706,44.300879
2023-81837,2023-06-19,000001,Vente,13500,,,LES FULGADOUX,B043,07460,07211,Saint-André-de-Cruzières,07,,,072110000C0132,,,,,,,,,,,,,0,,,,,BT,taillis simples,,,5040,4.183316,44.311464
2023-81837,2023-06-19,000001,Vente,13500,,,LES FULGADOUX,B043,07460,07211,Saint-André-de-Cruzières,07,,,072110000C0134,,,,,,,,,,,,,0,,,,,L,landes,,,18760,4.184014,44.312021
2023-81837,2023-06-19,000001,Vente,13500,,,LES TERRASSES,B071,07460,07211,Saint-André-de-Cruzières,07,,,072110000C0149,,,,,,,,,,,,,0,,,,,BT,taillis simples,,,13120,4.184545,44.310893
2023-81843,2023-06-14,000001,Vente,4000,,,LES PRATS ET LES MOUNEDES,B065,07460,07211,Saint-André-de-Cruzières,07,,,072110000C0421,,,,,,,,,,,,,0,,,,,VI,vignes,,,3433,4.203285,44.314373
2023-81843,2023-06-14,000001,Vente,4000,,,LES PRATS ET LES MOUNEDES,B065,07460,07211,Saint-André-de-Cruzières,07,,,072110000C0421,,,,,,,,,,,,,0,,,,,VI,vignes,,,1717,4.203285,44.314373
2023-81843,2023-06-14,000001,Vente,4000,,,LES PRATS ET LES MOUNEDES,B065,07460,07211,Saint-André-de-Cruzières,07,,,072110000C0503,,,,,,,,,,,,,0,,,,,VI,vignes,,,2950,4.20366,44.314387
2023-81844,2023-06-14,000001,Vente,15650,,,LA FABREGE,B036,07460,07211,Saint-André-de-Cruzières,07,,,072110000A0910,,,,,,,,,,,,,0,,,,,VI,vignes,,,5240,4.214149,44.319937
2023-81844,2023-06-14,000001,Vente,15650,,,LA FABREGE,B036,07460,07211,Saint-André-de-Cruzières,07,,,072110000A0911,,,,,,,,,,,,,0,,,,,P,prés,,,1540,4.214086,44.319407
2023-81844,2023-06-14,000001,Vente,15650,,,LA FABREGE,B036,07460,07211,Saint-André-de-Cruzières,07,,,072110000A0912,,,,,,,,,,,,,0,,,,,L,landes,,,250,4.214309,44.319364
2023-81844,2023-06-14,000001,Vente,15650,,,FOND PERDU,B039,07460,07211,Saint-André-de-Cruzières,07,,,072110000C0640,,,,,,,,,,,,,0,,,,,VI,vignes,,,2450,4.207196,44.311676
2023-81844,2023-06-14,000001,Vente,15650,,,FOND PERDU,B039,07460,07211,Saint-André-de-Cruzières,07,,,072110000C0644,,,,,,,,,,,,,0,,,,,VI,vignes,,,1000,4.208964,44.311333
2023-81844,2023-06-14,000001,Vente,15650,,,FOND PERDU,B039,07460,07211,Saint-André-de-Cruzières,07,,,072110000C0644,,,,,,,,,,,,,0,,,,,T,terres,,,2250,4.208964,44.311333
2023-81844,2023-06-14,000001,Vente,15650,,,FOND PERDU,B039,07460,07211,Saint-André-de-Cruzières,07,,,072110000C0645,,,,,,,,,,,,,0,,,,,VI,vignes,,,2800,4.2096,44.311427
2023-81844,2023-06-14,000001,Vente,15650,,,LES TRAVERS,B072,07460,07211,Saint-André-de-Cruzières,07,,,072110000C0750,,,,,,,,,,,,,0,,,,,VI,vignes,,,170,4.204617,44.311781
2023-81844,2023-06-14,000001,Vente,15650,,,LES TRAVERS,B072,07460,07211,Saint-André-de-Cruzières,07,,,072110000C0752,,,,,,,,,,,,,0,,,,,VI,vignes,,,230,4.204552,44.311704
2023-81844,2023-06-14,000001,Vente,15650,,,LES TRAVERS,B072,07460,07211,Saint-André-de-Cruzières,07,,,072110000C0753,,,,,,,,,,,,,0,,,,,VI,vignes,,,850,4.2046,44.311442
2023-81844,2023-06-14,000001,Vente,15650,,,LES TRAVERS,B072,07460,07211,Saint-André-de-Cruzières,07,,,072110000C0762,,,,,,,,,,,,,0,,,,,VI,vignes,,,1820,4.202948,44.311367
2023-81844,2023-06-14,000001,Vente,15650,,,LES TRAVERS,B072,07460,07211,Saint-André-de-Cruzières,07,,,072110000C0762,,,,,,,,,,,,,0,,,,,VI,vignes,,,1820,4.202948,44.311367
2023-81844,2023-06-14,000001,Vente,15650,,,LES TRAVERS,B072,07460,07211,Saint-André-de-Cruzières,07,,,072110000C0763,,,,,,,,,,,,,0,,,,,VI,vignes,,,945,4.203188,44.311153
2023-81844,2023-06-14,000001,Vente,15650,,,LES TRAVERS,B072,07460,07211,Saint-André-de-Cruzières,07,,,072110000C0765,,,,,,,,,,,,,0,,,,,VI,vignes,,,660,4.203589,44.311396
2023-81844,2023-06-14,000001,Vente,15650,,,LES TRAVERS,B072,07460,07211,Saint-André-de-Cruzières,07,,,072110000C0766,,,,,,,,,,,,,0,,,,,VI,vignes,,,725,4.203476,44.311041
2023-81844,2023-06-14,000001,Vente,15650,,,LES TRAVERS,B072,07460,07211,Saint-André-de-Cruzières,07,,,072110000C0767,,,,,,,,,,,,,0,,,,,VI,vignes,,,405,4.203398,44.310852
2023-81844,2023-06-14,000001,Vente,15650,,,LE PEYROL,B058,07460,07211,Saint-André-de-Cruzières,07,,,072110000C0857,,,,,,,,,,,,,0,,,,,VI,vignes,,,2650,4.20013,44.311642
2023-81844,2023-06-14,000001,Vente,15650,,,LE PEYROL,B058,07460,07211,Saint-André-de-Cruzières,07,,,072110000C0858,,,,,,,,,,,,,0,,,,,L,landes,,,1000,4.200089,44.311053
2023-81844,2023-06-14,000001,Vente,15650,,,LES TRAVERS,B072,07460,07211,Saint-André-de-Cruzières,07,,,072110000C1192,,,,,,,,,,,,,0,,,,,VI,vignes,,,946,4.204456,44.311222
2023-81844,2023-06-14,000001,Vente,15650,,,LES TRAVERS,B072,07460,07211,Saint-André-de-Cruzières,07,,,072110000C1361,,,,,,,,,,,,,0,,,,,VI,vignes,,,1403,4.204591,44.310943
2023-81844,2023-06-14,000001,Vente,15650,,,LES TRAVERS,B072,07460,07211,Saint-André-de-Cruzières,07,,,072110000C1363,,,,,,,,,,,,,0,,,,,VI,vignes,,,1177,4.204816,44.311527
2023-82143,2023-06-22,000001,Vente,7000,,,LES CLAUX NEUFS,B023,07460,07211,Saint-André-de-Cruzières,07,,,072110000A0892,,,,,,,,,,,,,0,,,,,L,landes,,,6080,4.212725,44.323174
2023-82145,2023-06-16,000001,Vente,1470,,,BOURDARIC,B009,07460,07211,Saint-André-de-Cruzières,07,,,072110000C0549,,,,,,,,,,,,,0,,,,,VI,vignes,,,1470,4.212342,44.314195
2023-82414,2023-05-30,000001,Vente,15,,,LES TRAVERS,B072,07460,07211,Saint-André-de-Cruzières,07,,,072110000C1305,,,,,,,,,,,,,0,,,,,T,terres,,,57,4.200701,44.311279
2023-82414,2023-05-30,000001,Vente,15,,,CHAZELLES,B020,07460,07211,Saint-André-de-Cruzières,07,,,072110000C1312,,,,,,,,,,,,,0,,,,,VE,vergers,OLIVE,Oliveraie ou oliviers,17,4.200644,44.311315
2023-82626,2023-07-06,000002,Vente,300,,,LE CLOS DE BARON,B025,07460,07211,Saint-André-de-Cruzières,07,,,072110000C1366,,,,,,,,,,,,,0,,,,,L,landes,,,36,4.20648,44.311556
2023-83314,2023-07-24,000002,Vente,300,,,FOND PERDU,B039,07460,07211,Saint-André-de-Cruzières,07,,,072110000C1368,,,,,,,,,,,,,0,,,,,P,prés,,,44,4.213843,44.31219
2023-83418,2023-08-28,000001,Vente,239190,,,PIERREGRAS,B061,07460,07211,Saint-André-de-Cruzières,07,,,072110000D0120,,,,,,,,,,,,,0,,,,,VE,vergers,OLIVE,Oliveraie ou oliviers,660,4.212216,44.307365
2023-83418,2023-08-28,000001,Vente,239190,25,,CHE DE LA PEIRILLE,0103,07460,07211,Saint-André-de-Cruzières,07,,,072110000D0121,,,,,,,,,,,,,0,3,Dépendance,,0,S,sols,,,630,4.212316,44.307263
2023-83418,2023-08-28,000001,Vente,239190,25,,CHE DE LA PEIRILLE,0103,07460,07211,Saint-André-de-Cruzières,07,,,072110000D0121,,,,,,,,,,,,,0,1,Maison,110,4,S,sols,,,630,4.212316,44.307263
2023-83418,2023-08-28,000001,Vente,239190,,,LA PEIRILLE,B056,07460,07211,Saint-André-de-Cruzières,07,,,072110000D0845,,,,,,,,,,,,,0,,,,,T,terres,,,120,4.212223,44.307053
2023-83537,2023-08-11,000001,Vente,10500,,,CHAMPARAS,B017,07460,07211,Saint-André-de-Cruzières,07,,,072110000D0284,,,,,,,,,,,,,0,,,,,VI,vignes,,,1480,4.231903,44.303886
2023-83537,2023-08-11,000001,Vente,10500,,,CHAMPARAS,B017,07460,07211,Saint-André-de-Cruzières,07,,,072110000D0285,,,,,,,,,,,,,0,,,,,VI,vignes,,,4540,4.23163,44.303552
2023-83537,2023-08-11,000001,Vente,10500,,,CHAMPARAS,B017,07460,07211,Saint-André-de-Cruzières,07,,,072110000D0289,,,,,,,,,,,,,0,,,,,VI,vignes,,,5400,4.230785,44.303025
2023-83537,2023-08-11,000001,Vente,10500,,,CHAMPARAS,B017,07460,07211,Saint-André-de-Cruzières,07,,,072110000D0309,,,,,,,,,,,,,0,,,,,VI,vignes,,,12300,4.229631,44.305005
2023-83537,2023-08-11,000001,Vente,10500,,,CHAMPARAS,B017,07460,07211,Saint-André-de-Cruzières,07,,,072110000D0310,,,,,,,,,,,,,0,,,,,VI,vignes,,,520,4.229639,44.303572
2023-83537,2023-08-11,000001,Vente,10500,,,CHAMPARAS,B017,07460,07211,Saint-André-de-Cruzières,07,,,072110000D0311,,,,,,,,,,,,,0,,,,,T,terres,,,1240,4.229786,44.303209
2023-83537,2023-08-11,000001,Vente,10500,,,CHAMPARAS,B017,07460,07211,Saint-André-de-Cruzières,07,,,072110000D0311,,,,,,,,,,,,,0,,,,,VI,vignes,,,1980,4.229786,44.303209
2023-83537,2023-08-11,000001,Vente,10500,,,CHAMPARAS,B017,07460,07211,Saint-André-de-Cruzières,07,,,072110000D0314,,,,,,,,,,,,,0,,,,,VI,vignes,,,7750,4.229047,44.303313
2023-83611,2023-08-31,000001,Vente,45000,,,BOURDARIC,B009,07460,07211,Saint-André-de-Cruzières,07,,,072110000C1297,,,,,,,,,,,,,0,,,,,P,prés,,,140,4.210217,44.314613
2023-83611,2023-08-31,000001,Vente,45000,,,BOURDARIC,B009,07460,07211,Saint-André-de-Cruzières,07,,,072110000C1299,,,,,,,,,,,,,0,,,,,T,terres,,,776,4.210414,44.314915
2023-83611,2023-08-31,000001,Vente,45000,,,BOURDARIC,B009,07460,07211,Saint-André-de-Cruzières,07,,,072110000C1299,,,,,,,,,,,,,0,,,,,T,terres,,,776,4.210414,44.314915
2023-84145,2023-09-27,000001,Vente,1815,,,LES GACHETTES,B044,07460,07211,Saint-André-de-Cruzières,07,,,072110000A0299,,,,,,,,,,,,,0,,,,,T,terres,,,4920,4.191427,44.327126
2023-84145,2023-09-27,000001,Vente,1815,,,LES GACHETTES,B044,07460,07211,Saint-André-de-Cruzières,07,,,072110000A0300,,,,,,,,,,,,,0,,,,,L,landes,,,1100,4.191608,44.326643
2023-84145,2023-09-27,000001,Vente,1815,,,LES GACHETTES,B044,07460,07211,Saint-André-de-Cruzières,07,,,072110000A0311,,,,,,,,,,,,,0,,,,,VI,vignes,,,3270,4.191682,44.323081
2023-84145,2023-09-27,000001,Vente,1815,,,CHADOUILLER,B013,07460,07211,Saint-André-de-Cruzières,07,,,072110000A1183,,,,,,,,,,,,,0,,,,,S,sols,,,35,4.196266,44.31994
2023-84145,2023-09-27,000001,Vente,1815,,,LES FULGADOUX,B043,07460,07211,Saint-André-de-Cruzières,07,,,072110000C0117,,,,,,,,,,,,,0,,,,,BT,taillis simples,,,720,4.178901,44.314793
2023-84145,2023-09-27,000001,Vente,1815,,,LES FULGADOUX,B043,07460,07211,Saint-André-de-Cruzières,07,,,072110000C0118,,,,,,,,,,,,,0,,,,,L,landes,,,2680,4.179806,44.314513
2023-84145,2023-09-27,000001,Vente,1815,,,LE PEYREJAL,B057,07460,07211,Saint-André-de-Cruzières,07,,,072110000C0155,,,,,,,,,,,,,0,,,,,T,terres,,,2945,4.189248,44.318497
2023-84145,2023-09-27,000001,Vente,1815,,,LE PEYREJAL,B057,07460,07211,Saint-André-de-Cruzières,07,,,072110000C0156,,,,,,,,,,,,,0,,,,,L,landes,,,1295,4.190564,44.318473
2023-84145,2023-09-27,000001,Vente,1815,,,LE PEYREJAL,B057,07460,07211,Saint-André-de-Cruzières,07,,,072110000C0158,,,,,,,,,,,,,0,,,,,T,terres,,,4165,4.189413,44.317819
2023-84145,2023-09-27,000001,Vente,1815,,,LE PEYREJAL,B057,07460,07211,Saint-André-de-Cruzières,07,,,072110000C0159,,,,,,,,,,,,,0,,,,,L,landes,,,780,4.189571,44.317508
2023-84145,2023-09-27,000001,Vente,1815,,,LE PEYREJAL,B057,07460,07211,Saint-André-de-Cruzières,07,,,072110000C0160,,,,,,,,,,,,,0,,,,,L,landes,,,3450,4.19009,44.317718
2023-84146,2023-09-27,000001,Vente,685,,,LE TREPOUZE,B074,07460,07211,Saint-André-de-Cruzières,07,,,072110000A0133,,,,,,,,,,,,,0,,,,,VE,vergers,OLIVE,Oliveraie ou oliviers,1300,4.192699,44.329817
2023-84146,2023-09-27,000001,Vente,685,,,LE TREPOUZE,B074,07460,07211,Saint-André-de-Cruzières,07,,,072110000A0134,,,,,,,,,,,,,0,,,,,VI,vignes,,,420,4.192483,44.329606
2023-84146,2023-09-27,000001,Vente,685,,,LE COMBALET,B028,07460,07211,Saint-André-de-Cruzières,07,,,072110000A1142,,,,,,,,,,,,,0,,,,,VE,vergers,OLIVE,Oliveraie ou oliviers,600,4.20419,44.317583
2023-84146,2023-09-27,000001,Vente,685,,,LE PEYREJAL,B057,07460,07211,Saint-André-de-Cruzières,07,,,072110000C0186,,,,,,,,,,,,,0,,,,,L,landes,,,2350,4.192864,44.315047
2023-84146,2023-09-27,000001,Vente,685,,,LE PEYREJAL,B057,07460,07211,Saint-André-de-Cruzières,07,,,072110000C0187,,,,,,,,,,,,,0,,,,,T,terres,,,4900,4.192876,44.315107
2023-84301,2023-09-29,000002,Vente,564472,5404,,LA FABREGE,B036,07460,07211,Saint-André-de-Cruzières,07,,,072110000A1516,,,,,,,,,,,,,0,2,Appartement,30,1,S,sols,,,443,4.215259,44.317521
2023-84301,2023-09-29,000002,Vente,564472,5404,,LA FABREGE,B036,07460,07211,Saint-André-de-Cruzières,07,,,072110000A1516,,,,,,,,,,,,,0,2,Appartement,36,2,S,sols,,,443,4.215259,44.317521
2023-84301,2023-09-29,000002,Vente,564472,,,LA FABREGE,B036,07460,07211,Saint-André-de-Cruzières,07,,,072110000A1527,,,,,,,,,,,,,0,,,,,L,landes,,,328,4.215495,44.317524
2023-84377,2023-09-20,000001,Vente,170000,45,,CHE DU PEYROL,0107,07460,07211,Saint-André-de-Cruzières,07,,,072110000C0214,,,,,,,,,,,,,0,1,Maison,157,5,S,sols,,,700,4.194406,44.319615
2023-84377,2023-09-20,000001,Vente,170000,45,,CHE DU PEYROL,0107,07460,07211,Saint-André-de-Cruzières,07,,,072110000C0214,,,,,,,,,,,,,0,1,Maison,157,5,L,landes,,,500,4.194406,44.319615
2023-84406,2023-09-28,000001,Vente,230000,5259,B,LES AIRES,B002,07460,07211,Saint-André-de-Cruzières,07,,,072110000A1047,,,,,,,,,,,,,0,3,Dépendance,,0,S,sols,,,490,4.207729,44.317837
2023-84406,2023-09-28,000001,Vente,230000,810,,RTE DE SAINT PAUL LE JEUNE,0164,07460,07211,Saint-André-de-Cruzières,07,,,072110000A1049,,,,,,,,,,,,,0,1,Maison,88,5,T,terres,,,3360,4.207667,44.317694
2023-84406,2023-09-28,000001,Vente,230000,810,,RTE DE SAINT PAUL LE JEUNE,0164,07460,07211,Saint-André-de-Cruzières,07,,,072110000A1049,,,,,,,,,,,,,0,1,Maison,88,5,S,sols,,,1000,4.207667,44.317694
2023-84459,2023-09-25,000001,Vente,5000,,,LES COURPATIERES,B031,07460,07211,Saint-André-de-Cruzières,07,,,072110000C0002,,,,,,,,,,,,,0,,,,,VE,vergers,OLIVE,Oliveraie ou oliviers,880,4.183764,44.322149
2023-84459,2023-09-25,000001,Vente,5000,,,LES COURPATIERES,B031,07460,07211,Saint-André-de-Cruzières,07,,,072110000C0003,,,,,,,,,,,,,0,,,,,L,landes,,,2920,4.183217,44.321706
2023-84459,2023-09-25,000001,Vente,5000,,,LES COCOLIERES,B027,07460,07211,Saint-André-de-Cruzières,07,,,072110000C0036,,,,,,,,,,,,,0,,,,,L,landes,,,800,4.180268,44.319507
2023-84459,2023-09-25,000001,Vente,5000,,,LES COCOLIERES,B027,07460,07211,Saint-André-de-Cruzières,07,,,072110000C0037,,,,,,,,,,,,,0,,,,,L,landes,,,16440,4.180776,44.31908