id_mutation,date_mutation,numero_disposition,nature_mutation,valeur_fonciere,adresse_numero,adresse_suffixe,adresse_nom_voie,adresse_code_voie,code_postal,code_commune,nom_commune,code_departement,ancien_code_commune,ancien_nom_commune,id_parcelle,ancien_id_parcelle,numero_volume,lot1_numero,lot1_surface_carrez,lot2_numero,lot2_surface_carrez,lot3_numero,lot3_surface_carrez,lot4_numero,lot4_surface_carrez,lot5_numero,lot5_surface_carrez,nombre_lots,code_type_local,type_local,surface_reelle_bati,nombre_pieces_principales,code_nature_culture,nature_culture,code_nature_culture_speciale,nature_culture_speciale,surface_terrain,longitude,latitude
2023-86717,2023-01-26,000001,Echange,3500,,,LA PREE,B042,08600,08247,Landrichamps,08,,,082470000A0548,,,,,,,,,,,,,0,,,,,P,prés,,,38,4.832955,50.092277
2023-86717,2023-01-26,000001,Echange,3500,,,CHAUMONT,B016,08600,08247,Landrichamps,08,,,082470000B0050,,,,,,,,,,,,,0,,,,,P,prés,,,540,4.832532,50.089741
2023-87318,2023-03-01,000001,Vente,5000,,,LE VILLAGE,B060,08600,08247,Landrichamps,08,,,082470000A0345,,,,,,,,,,,,,0,,,,,S,sols,,,239,4.829498,50.088928
2023-87321,2023-03-02,000001,Vente,5000,5049,,LE VILLAGE,B060,08600,08247,Landrichamps,08,,,082470000A0317,,,,,,,,,,,,,0,3,Dépendance,,0,S,sols,,,1356,4.831184,50.091217
2023-90845,2023-10-12,000001,Vente,300000,,,LE VILLAGE,B060,08600,08247,Landrichamps,08,,,082470000A0371,,,,,,,,,,,,,0,,,,,S,sols,,,1934,4.82852,50.088119
2023-90845,2023-10-12,000001,Vente,300000,,,LE VILLAGE,B060,08600,08247,Landrichamps,08,,,082470000A0372,,,,,,,,,,,,,0,,,,,J,jardins,,,246,4.82877,50.087955
2023-90845,2023-10-12,000001,Vente,300000,16,,RUE DE LA HOUILLE,0023,08600,08247,Landrichamps,08,,,082470000A0373,,,,,,,,,,,,,0,1,Maison,167,4,S,sols,,,444,4.828743,50.088123
2023-90845,2023-10-12,000001,Vente,300000,,,LE VILLAGE,B060,08600,08247,Landrichamps,08,,,082470000A0374,,,,,,,,,,,,,0,,,,,S,sols,,,207,4.828708,50.088277
2023-91439,2023-11-09,000001,Vente,1200,,,LE STET,B055,08600,08247,Landrichamps,08,,,082470000A0181,,,,,,,,,,,,,0,,,,,T,terres,,,1105,4.828319,50.085137
2023-91439,2023-11-09,000001,Vente,1200,,,LE STET,B055,08600,08247,Landrichamps,08,,,082470000A0182,,,,,,,,,,,,,0,,,,,T,terres,,,1070,4.828062,50.085164
