id_mutation,date_mutation,numero_disposition,nature_mutation,valeur_fonciere,adresse_numero,adresse_suffixe,adresse_nom_voie,adresse_code_voie,code_postal,code_commune,nom_commune,code_departement,ancien_code_commune,ancien_nom_commune,id_parcelle,ancien_id_parcelle,numero_volume,lot1_numero,lot1_surface_carrez,lot2_numero,lot2_surface_carrez,lot3_numero,lot3_surface_carrez,lot4_numero,lot4_surface_carrez,lot5_numero,lot5_surface_carrez,nombre_lots,code_type_local,type_local,surface_reelle_bati,nombre_pieces_principales,code_nature_culture,nature_culture,code_nature_culture_speciale,nature_culture_speciale,surface_terrain,longitude,latitude
2023-97730,2023-01-26,000001,Vente,2600,,,LE HAUT DES VIGNES,B039,10500,10283,Pel-et-Der,10,,,10283000ZE0048,,,,,,,,,,,,,0,,,,,BS,taillis sous futaie,,,1690,4.423584,48.410159
2023-97783,2023-01-16,000001,Vente,2156,,,HAIE BRIGNELLE,B035,10500,10283,Pel-et-Der,10,,,10283000ZL0037,,,,,,,,,,,,,0,,,,,BS,taillis sous futaie,,,1090,4.433668,48.383426
2023-98722,2023-02-23,000001,Vente,38801,,,LE VILLAGE,B089,10500,10283,Pel-et-Der,10,,,10283000ZH0019,,,,,,,,,,,,,0,,,,,T,terres,,,660,4.414669,48.406073
2023-98722,2023-02-23,000001,Vente,38801,,,LE VILLAGE,B089,10500,10283,Pel-et-Der,10,,,10283000ZH0020,,,,,,,,,,,,,0,,,,,T,terres,,,1120,4.414215,48.406587
2023-98722,2023-02-23,000001,Vente,38801,,,LE VILLAGE,B089,10500,10283,Pel-et-Der,10,,,10283000ZH0067,,,,,,,,,,,,,0,,,,,VE,vergers,,,4307,4.413301,48.406139
2023-98722,2023-02-23,000001,Vente,38801,,,LE VILLAGE,B089,10500,10283,Pel-et-Der,10,,,10283000ZH0068,,,,,,,,,,,,,0,,,,,T,terres,,,4846,4.413887,48.405977
2023-98722,2023-02-23,000001,Vente,38801,,,LE VILLAGE,B089,10500,10283,Pel-et-Der,10,,,10283000ZH0069,,,,,,,,,,,,,0,,,,,VE,vergers,,,635,4.413624,48.405624
2023-98722,2023-02-23,000001,Vente,38801,33,,GRANDE RUE DE PEL,0050,10500,10283,Pel-et-Der,10,,,10283000ZH0070,,,,,,,,,,,,,0,1,Maison,104,5,S,sols,,,1534,4.413401,48.40576
2023-98722,2023-02-23,000001,Vente,38801,33,,GRANDE RUE DE PEL,0050,10500,10283,Pel-et-Der,10,,,10283000ZH0070,,,,,,,,,,,,,0,3,Dépendance,,0,S,sols,,,1534,4.413401,48.40576
2023-98722,2023-02-23,000001,Vente,38801,33,,GRANDE RUE DE PEL,0050,10500,10283,Pel-et-Der,10,,,10283000ZH0070,,,,,,,,,,,,,0,3,Dépendance,,0,S,sols,,,1534,4.413401,48.40576
2023-99532,2023-04-14,000001,Vente,14000,,,LE VILLAGE,B089,10500,10283,Pel-et-Der,10,,,10283000AB0142,,,,,,,,,,,,,0,,,,,AB,terrains a bâtir,,,900,4.414716,48.4024
2023-99671,2023-04-28,000001,Vente,47849,,,L ETANG,B027,10500,10283,Pel-et-Der,10,,,10283000ZD0040,,,,,,,,,,,,,0,,,,,T,terres,,,6350,4.404536,48.416781
2023-99671,2023-04-28,000001,Vente,47849,,,L ETANG,B027,10500,10283,Pel-et-Der,10,,,10283000ZD0045,,,,,,,,,,,,,0,,,,,T,terres,,,1130,4.406722,48.417879
2023-100213,2023-05-25,000001,Vente,200000,2,,RUE SAINT PIERRE,0120,10500,10283,Pel-et-Der,10,,,10283000AC0020,,,,,,,,,,,,,0,1,Maison,58,3,S,sols,,,1276,4.416562,48.39696
2023-100213,2023-05-25,000001,Vente,200000,,,LE VILLAGE,B089,10500,10283,Pel-et-Der,10,,,10283000AC0021,,,,,,,,,,,,,0,,,,,J,jardins,,,588,4.415874,48.397187
2023-100213,2023-05-25,000001,Vente,200000,27,,RUE GRANDE RUE DE DER,0030,10500,10283,Pel-et-Der,10,,,10283000AC0022,,,,,,,,,,,,,0,1,Maison,143,2,S,sols,,,1256,4.415568,48.397149
2023-100213,2023-05-25,000001,Vente,200000,,,LE VILLAGE,B089,10500,10283,Pel-et-Der,10,,,10283000AC0082,,,,,,,,,,,,,0,,,,,P,prés,,,5903,4.415824,48.396944
2023-102199,2023-09-07,000001,Vente,1700,,,L ETANG,B027,10500,10283,Pel-et-Der,10,,,10283000ZD0054,,,,,,,,,,,,,0,,,,,BT,taillis simples,,,2160,4.408935,48.418253
2023-102409,2023-09-08,000001,Vente,2000,,,L ETANG,B027,10500,10283,Pel-et-Der,10,,,102830000A0084,,,,,,,,,,,,,0,,,,,BS,taillis sous futaie,,,10096,4.397982,48.416854
2023-103085,2023-10-20,000001,Vente,2500,,,HAIE BRIGNELLE,B035,10500,10283,Pel-et-Der,10,,,10283000ZL0031,,,,,,,,,,,,,0,,,,,BP,peupleraies,,,1470,4.434555,48.382997
2023-103085,2023-10-20,000001,Vente,2500,,,HAIE BRIGNELLE,B035,10500,10283,Pel-et-Der,10,,,10283000ZL0032,,,,,,,,,,,,,0,,,,,BP,peupleraies,,,1500,4.434719,48.382916
2023-103392,2023-11-10,000001,Vente,100000,,,LE VILLAGE,B089,10500,10283,Pel-et-Der,10,,,10283000AB0075,,,,,,,,,,,,,0,,,,,S,sols,,,872,4.416969,48.400831
2023-103392,2023-11-10,000001,Vente,100000,,,LE VILLAGE,B089,10500,10283,Pel-et-Der,10,,,10283000AB0076,,,,,,,,,,,,,0,,,,,S,sols,,,57,4.416732,48.400848
2023-103392,2023-11-10,000001,Vente,100000,3,,RUE GRANDE RUE DE DER,0030,10500,10283,Pel-et-Der,10,,,10283000AB0077,,,,,,,,,,,,,0,1,Maison,84,4,S,sols,,,1200,4.416843,48.400645
2023-103392,2023-11-10,000001,Vente,100000,3,,RUE GRANDE RUE DE DER,0030,10500,10283,Pel-et-Der,10,,,10283000AB0077,,,,,,,,,,,,,0,3,Dépendance,,0,S,sols,,,1200,4.416843,48.400645
