id_mutation,date_mutation,numero_disposition,nature_mutation,valeur_fonciere,adresse_numero,adresse_suffixe,adresse_nom_voie,adresse_code_voie,code_postal,code_commune,nom_commune,code_departement,ancien_code_commune,ancien_nom_commune,id_parcelle,ancien_id_parcelle,numero_volume,lot1_numero,lot1_surface_carrez,lot2_numero,lot2_surface_carrez,lot3_numero,lot3_surface_carrez,lot4_numero,lot4_surface_carrez,lot5_numero,lot5_surface_carrez,nombre_lots,code_type_local,type_local,surface_reelle_bati,nombre_pieces_principales,code_nature_culture,nature_culture,code_nature_culture_speciale,nature_culture_speciale,surface_terrain,longitude,latitude
2023-104776,2023-01-18,000001,Vente,175000,19,,RUE DE BOULZANNE,0009,11230,11400,Tréziers,11,,,11400000AA0003,,,,,,,,,,,,,0,1,Maison,98,4,P,prés,,,1055,1.950726,43.059094
2023-104776,2023-01-18,000001,Vente,175000,19,,RUE DE BOULZANNE,0009,11230,11400,Tréziers,11,,,11400000AA0003,,,,,,,,,,,,,0,1,Maison,98,4,S,sols,,,500,1.950726,43.059094
2023-105686,2023-02-03,000001,Vente,47000,,,BOULZANO,B014,11230,11400,Tréziers,11,,,11400000ZA0090,,,,,,,,,,,,,0,,,,,T,terres,,,1876,1.948438,43.060291
2023-106264,2023-02-28,000001,Vente,119500,5,,RUE DU CHATEAU,0012,11230,11400,Tréziers,11,,,11400000AA0028,,,,,,,,,,,,,0,1,Maison,140,4,S,sols,,,88,1.954298,43.056844
2023-106264,2023-02-28,000001,Vente,119500,,,LE VILLAGE,B047,11230,11400,Tréziers,11,,,11400000AA0038,,,,,,,,,,,,,0,,,,,S,sols,,,32,1.954453,43.056813
2023-106264,2023-02-28,000001,Vente,119500,,,LE POUMAIRET,B041,11230,11400,Tréziers,11,,,11400000AA0057,,,,,,,,,,,,,0,,,,,T,terres,,,258,1.956136,43.056514
2023-112526,2023-07-27,000001,Vente,80000,18,,LE VILLAGE,B047,11230,11400,Tréziers,11,,,11400000AA0021,,,,,,,,,,,,,0,3,Dépendance,,0,S,sols,,,109,1.953625,43.057264
2023-112526,2023-07-27,000001,Vente,80000,33,,LE VILLAGE,B047,11230,11400,Tréziers,11,,,11400000AA0022,,,,,,,,,,,,,0,1,Maison,80,4,S,sols,,,86,1.953628,43.057199
2023-112526,2023-07-27,000001,Vente,80000,,,LAS ROUCATIEROS,B034,11230,11400,Tréziers,11,,,11400000ZE0102,,,,,,,,,,,,,0,,,,,P,prés,,,194,1.95372,43.056779
2023-114003,2023-09-28,000002,Vente,5000,,,LE VILLAGE,B047,11230,11400,Tréziers,11,,,11400000AA0221,,,,,,,,,,,,,0,,,,,S,sols,,,98,1.952998,43.057421
2023-114948,2023-10-19,000002,Vente,42000,,,LE VILLAGE,B047,11230,11400,Tréziers,11,,,11400000AA0215,,,,,,,,,,,,,0,,,,,S,sols,,,505,1.953057,43.057042
