id_mutation,date_mutation,numero_disposition,nature_mutation,valeur_fonciere,adresse_numero,adresse_suffixe,adresse_nom_voie,adresse_code_voie,code_postal,code_commune,nom_commune,code_departement,ancien_code_commune,ancien_nom_commune,id_parcelle,ancien_id_parcelle,numero_volume,lot1_numero,lot1_surface_carrez,lot2_numero,lot2_surface_carrez,lot3_numero,lot3_surface_carrez,lot4_numero,lot4_surface_carrez,lot5_numero,lot5_surface_carrez,nombre_lots,code_type_local,type_local,surface_reelle_bati,nombre_pieces_principales,code_nature_culture,nature_culture,code_nature_culture_speciale,nature_culture_speciale,surface_terrain,longitude,latitude
2023-186226,2023-05-11,000001,Vente,50000,,,MORTAIGRE,B109,16350,16054,Le Bouchage,16,,,160540000A0755,,,,,,,,,,,,,0,,,,,L,landes,,,255,0.367894,46.059317
2023-186226,2023-05-11,000001,Vente,50000,,,MORTAIGRE,B109,16350,16054,Le Bouchage,16,,,160540000A0851,,,,,,,,,,,,,0,,,,,T,terres,,,782,0.367656,46.059574
2023-186226,2023-05-11,000001,Vente,50000,5,,MORTAIGRE,B109,16350,16054,Le Bouchage,16,,,160540000A0852,,,,,,,,,,,,,0,1,Maison,66,2,T,terres,,,1345,0.367965,46.059471
2023-186226,2023-05-11,000001,Vente,50000,5,,MORTAIGRE,B109,16350,16054,Le Bouchage,16,,,160540000A0852,,,,,,,,,,,,,0,1,Maison,66,2,S,sols,,,500,0.367965,46.059471
2023-186284,2023-05-16,000001,Vente,754,,,CHAMPS DE BRETELOT,B032,16350,16054,Le Bouchage,16,,,160540000B0269,,,,,,,,,,,,,0,,,,,T,terres,,,632,0.387578,46.057246
2023-186284,2023-05-16,000001,Vente,754,,,CHAMPS DE BRETELOT,B032,16350,16054,Le Bouchage,16,,,160540000B0270,,,,,,,,,,,,,0,,,,,T,terres,,,1524,0.387516,46.057302
2023-186295,2023-05-16,000001,Vente,500,,,LES PICHAUDES,B120,16350,16054,Le Bouchage,16,,,160540000B0114,,,,,,,,,,,,,0,,,,,P,prés,,,1340,0.380589,46.051505
2023-186295,2023-05-16,000001,Vente,500,,,AU PALOTON,B113,16350,16054,Le Bouchage,16,,,160540000B0148,,,,,,,,,,,,,0,,,,,T,terres,,,3500,0.381086,46.053654
2023-186800,2023-06-02,000001,Vente,500,5004,,LA GRANGE,B096,16350,16054,Le Bouchage,16,,,160540000A0594,,,,,,,,,,,,,0,1,Maison,50,1,S,sols,,,103,0.377802,46.049415
2023-186800,2023-06-02,000001,Vente,500,,,LA GRANGE,B096,16350,16054,Le Bouchage,16,,,160540000B0031,,,,,,,,,,,,,0,,,,,S,sols,,,166,0.37892,46.048936
2023-186800,2023-06-02,000001,Vente,500,,,LA GRANGE,B096,16350,16054,Le Bouchage,16,,,160540000B1096,,,,,,,,,,,,,0,,,,,S,sols,,,50,0.3789,46.048882
2023-186800,2023-06-02,000001,Vente,500,29,,LA GRANGE,B096,16350,16054,Le Bouchage,16,,,160540000B1097,,,,,,,,,,,,,0,,,,,S,sols,,,176,0.378914,46.0488
2023-186800,2023-06-02,000001,Vente,500,,,LES CHETIES VIGNES,B050,16350,16054,Le Bouchage,16,,,160540000C0614,,,,,,,,,,,,,0,,,,,T,terres,,,2280,0.376013,46.047404
2023-186804,2023-06-20,000001,Vente,2350,,,LA TREMBLAIE,B155,16350,16054,Le Bouchage,16,,,160540000A0147,,,,,,,,,,,,,0,,,,,BT,taillis simples,,,1594,0.358649,46.056033
2023-186804,2023-06-20,000001,Vente,2350,,,LAC DE LAVERGNE,B101,16350,16054,Le Bouchage,16,,,160540000B0185,,,,,,,,,,,,,0,,,,,T,terres,,,727,0.38437,46.054218
2023-186804,2023-06-20,000001,Vente,2350,,,LE CLAPIER,B060,16350,16054,Le Bouchage,16,,,160540000B0247,,,,,,,,,,,,,0,,,,,BT,taillis simples,,,3890,0.386693,46.053431
2023-186804,2023-06-20,000001,Vente,2350,,,CHAMPS DE BRETELOT,B032,16350,16054,Le Bouchage,16,,,160540000B0287,,,,,,,,,,,,,0,,,,,BT,taillis simples,,,2730,0.384159,46.056985
2023-186804,2023-06-20,000001,Vente,2350,,,CHAMPS DE LA CARTRAUDE,B033,16350,16054,Le Bouchage,16,,,160540000B0508,,,,,,,,,,,,,0,,,,,BT,taillis simples,,,2090,0.386394,46.046242
2023-186804,2023-06-20,000001,Vente,2350,,,LES CHETIES VIGNES,B050,16350,16054,Le Bouchage,16,,,160540000C0603,,,,,,,,,,,,,0,,,,,BT,taillis simples,,,1110,0.37445,46.046166
2023-186804,2023-06-20,000001,Vente,2350,,,LES CHETIES VIGNES,B050,16350,16054,Le Bouchage,16,,,160540000C0605,,,,,,,,,,,,,0,,,,,BT,taillis simples,,,690,0.373983,46.046302
2023-186819,2023-06-02,000001,Vente,2200,,,LAC DE LAVERGNE,B101,16350,16054,Le Bouchage,16,,,160540000B0203,,,,,,,,,,,,,0,,,,,VI,vignes,,,748,0.382295,46.0531
2023-186819,2023-06-02,000001,Vente,2200,,,LES SABLES,B145,16350,16054,Le Bouchage,16,,,160540000B0217,,,,,,,,,,,,,0,,,,,BT,taillis simples,,,320,0.381783,46.052663
2023-186819,2023-06-02,000001,Vente,2200,,,CHAMPS DE BRETELOT,B032,16350,16054,Le Bouchage,16,,,160540000B0282,,,,,,,,,,,,,0,,,,,BT,taillis simples,,,3650,0.38575,46.056036
2023-186819,2023-06-02,000001,Vente,2200,,,LE POTEAU,B127,16350,16054,Le Bouchage,16,,,160540000C0578,,,,,,,,,,,,,0,,,,,BT,taillis simples,,,880,0.373132,46.046173
2023-186819,2023-06-02,000001,Vente,2200,,,LES CHETIES VIGNES,B050,16350,16054,Le Bouchage,16,,,160540000C0599,,,,,,,,,,,,,0,,,,,BT,taillis simples,,,4390,0.375319,46.046301
2023-188205,2023-07-13,000001,Vente,28770,6,,CHEZ BERNARD,B053,16350,16054,Le Bouchage,16,,,160540000B1225,,,,,,,,,,,,,0,1,Maison,45,2,S,sols,,,75,0.396299,46.045358
2023-188205,2023-07-13,000001,Vente,28770,,,CHEZ BERNARD,B053,16350,16054,Le Bouchage,16,,,160540000B1249,,,,,,,,,,,,,0,,,,,T,terres,,,100,0.396301,46.045451
2023-188257,2023-07-13,000001,Vente,2000,,,LA TREMBLAIE,B155,16350,16054,Le Bouchage,16,,,160540000A0156,,,,,,,,,,,,,0,,,,,BT,taillis simples,,,189,0.359482,46.056751
2023-188257,2023-07-13,000001,Vente,2000,,,LA TREMBLAIE,B155,16350,16054,Le Bouchage,16,,,160540000A0163,,,,,,,,,,,,,0,,,,,BT,taillis simples,,,1974,0.360399,46.057005
2023-188257,2023-07-13,000001,Vente,2000,,,LA TREMBLAIE,B155,16350,16054,Le Bouchage,16,,,160540000A0167,,,,,,,,,,,,,0,,,,,BT,taillis simples,,,1732,0.360471,46.057727
2023-188257,2023-07-13,000001,Vente,2000,,,LES PATURAUX,B114,16350,16054,Le Bouchage,16,,,160540000A0485,,,,,,,,,,,,,0,,,,,BT,taillis simples,,,1401,0.36838,46.055495
2023-188257,2023-07-13,000001,Vente,2000,,,LA TREMBLAIE,B155,16350,16054,Le Bouchage,16,,,160540000A0691,,,,,,,,,,,,,0,,,,,BT,taillis simples,,,204,0.359084,46.057171
2023-188257,2023-07-13,000001,Vente,2000,,,LA TREMBLAIE,B155,16350,16054,Le Bouchage,16,,,160540000A0693,,,,,,,,,,,,,0,,,,,BT,taillis simples,,,1477,0.359376,46.057208
2023-188377,2023-07-18,000001,Vente,6000,,,LA GRANGE,B096,16350,16054,Le Bouchage,16,,,160540000B0013,,,,,,,,,,,,,0,,,,,J,jardins,,,398,0.378715,46.048598
2023-188377,2023-07-18,000001,Vente,6000,,,LA GRANGE,B096,16350,16054,Le Bouchage,16,,,160540000B0014,,,,,,,,,,,,,0,,,,,S,sols,,,290,0.378662,46.048746
2023-188377,2023-07-18,000001,Vente,6000,,,LA GRANGE,B096,16350,16054,Le Bouchage,16,,,160540000B0021,,,,,,,,,,,,,0,,,,,T,terres,,,1578,0.378288,46.050003
2023-188605,2023-05-09,000001,Vente,140,,,LES TERRIERES,B151,16350,16054,Le Bouchage,16,,,160540000A0206,,,,,,,,,,,,,0,,,,,P,prés,,,922,0.365106,46.063572
2023-188721,2023-08-24,000001,Vente,100000,22,,FRETET,B075,16350,16054,Le Bouchage,16,,,160540000C0542,,,,,,,,,,,,,0,1,Maison,100,4,S,sols,,,152,0.36841,46.049174
2023-188721,2023-08-24,000001,Vente,100000,,,FRETET,B075,16350,16054,Le Bouchage,16,,,160540000C1149,,,,,,,,,,,,,0,,,,,S,sols,,,240,0.368453,46.049287
2023-189453,2023-09-11,000001,Vente,163000,,,LA BETOULLE,B005,16350,16054,Le Bouchage,16,,,160540000C0857,,,,,,,,,,,,,0,,,,,T,terres,,,3570,0.375977,46.031987
2023-189475,2023-09-12,000001,Vente,80000,12,,LA GRANGE,B096,16350,16054,Le Bouchage,16,,,160540000B1214,,,,,,,,,,,,,0,3,Dépendance,,0,AG,terrains d'agrément,,,899,0.378234,46.048398
2023-189475,2023-09-12,000001,Vente,80000,12,,LA GRANGE,B096,16350,16054,Le Bouchage,16,,,160540000B1214,,,,,,,,,,,,,0,1,Maison,95,2,AG,terrains d'agrément,,,899,0.378234,46.048398
2023-189475,2023-09-12,000001,Vente,80000,12,,LA GRANGE,B096,16350,16054,Le Bouchage,16,,,160540000B1214,,,,,,,,,,,,,0,3,Dépendance,,0,AG,terrains d'agrément,,,899,0.378234,46.048398
2023-189475,2023-09-12,000001,Vente,80000,12,,LA GRANGE,B096,16350,16054,Le Bouchage,16,,,160540000B1214,,,,,,,,,,,,,0,1,Maison,95,2,S,sols,,,500,0.378234,46.048398
2023-189475,2023-09-12,000001,Vente,80000,12,,LA GRANGE,B096,16350,16054,Le Bouchage,16,,,160540000B1214,,,,,,,,,,,,,0,3,Dépendance,,0,S,sols,,,500,0.378234,46.048398
2023-189475,2023-09-12,000001,Vente,80000,12,,LA GRANGE,B096,16350,16054,Le Bouchage,16,,,160540000B1214,,,,,,,,,,,,,0,3,Dépendance,,0,S,sols,,,500,0.378234,46.048398
2023-189475,2023-09-12,000001,Vente,80000,12,,LA GRANGE,B096,16350,16054,Le Bouchage,16,,,160540000B1214,,,,,,,,,,,,,0,3,Dépendance,,0,AG,terrains d'agrément,,,899,0.378234,46.048398
2023-189475,2023-09-12,000001,Vente,80000,12,,LA GRANGE,B096,16350,16054,Le Bouchage,16,,,160540000B1214,,,,,,,,,,,,,0,3,Dépendance,,0,S,sols,,,500,0.378234,46.048398
2023-191070,2023-10-31,000001,Vente,6440.32,,,LA VALLEE,B157,16350,16054,Le Bouchage,16,,,160540000C0728,,,,,,,,,,,,,0,,,,,BT,taillis simples,,,1824,0.375877,46.040333
2023-192044,2023-12-21,000001,Vente,12500,,,LA BETOULLE,B005,16350,16054,Le Bouchage,16,,,160540000C0971,,,,,,,,,,,,,0,,,,,S,sols,,,515,0.377051,46.032916
2023-192044,2023-12-21,000001,Vente,12500,,,LA BETOULLE,B005,16350,16054,Le Bouchage,16,,,160540000C0973,,,,,,,,,,,,,0,,,,,T,terres,,,1180,0.377143,46.032629
