id_mutation,date_mutation,numero_disposition,nature_mutation,valeur_fonciere,adresse_numero,adresse_suffixe,adresse_nom_voie,adresse_code_voie,code_postal,code_commune,nom_commune,code_departement,ancien_code_commune,ancien_nom_commune,id_parcelle,ancien_id_parcelle,numero_volume,lot1_numero,lot1_surface_carrez,lot2_numero,lot2_surface_carrez,lot3_numero,lot3_surface_carrez,lot4_numero,lot4_surface_carrez,lot5_numero,lot5_surface_carrez,nombre_lots,code_type_local,type_local,surface_reelle_bati,nombre_pieces_principales,code_nature_culture,nature_culture,code_nature_culture_speciale,nature_culture_speciale,surface_terrain,longitude,latitude
2023-182909,2023-01-10,000001,Vente,35000,3,,RTE DE FONT FROIDE,0150,16310,16398,Verneuil,16,,,163980000B0835,,,,,,,,,,,,,0,1,Maison,28,1,S,sols,,,460,0.710658,45.768835
2023-182909,2023-01-10,000001,Vente,35000,5040,,LA GELIZANT,B012,16310,16398,Verneuil,16,,,163980000B0840,,,,,,,,,,,,,0,1,Maison,32,1,S,sols,,,78,0.710702,45.768736
2023-186666,2023-05-26,000001,Vente,21500,14,,RTE DES SALLES LAVAUGUYON,0350,16310,16398,Verneuil,16,,,163980000A0328,,,,,,,,,,,,,0,1,Maison,96,3,S,sols,,,181,0.693779,45.780206
2023-186666,2023-05-26,000001,Vente,21500,,,LE BOURG,B003,16310,16398,Verneuil,16,,,163980000A0330,,,,,,,,,,,,,0,,,,,J,jardins,,,314,0.694187,45.780237
2023-189067,2023-09-01,000001,Vente,21240,,,LA GRIMAUDIE,B015,16310,16398,Verneuil,16,,,163980000B0117,,,,,,,,,,,,,0,,,,,P,prés,,,5990,0.709013,45.78149
2023-189067,2023-09-01,000001,Vente,21240,,,LA GRIMAUDIE,B015,16310,16398,Verneuil,16,,,163980000B0117,,,,,,,,,,,,,0,,,,,E,eaux,ETANG,Etangs,3420,0.709013,45.78149
2023-189067,2023-09-01,000001,Vente,21240,,,LA GRIMAUDIE,B015,16310,16398,Verneuil,16,,,163980000B0117,,,,,,,,,,,,,0,,,,,BT,taillis simples,,,1400,0.709013,45.78149
2023-189067,2023-09-01,000001,Vente,21240,,,LA GRIMAUDIE,B015,16310,16398,Verneuil,16,,,163980000B0117,,,,,,,,,,,,,0,,,,,E,eaux,ETANG,Etangs,3300,0.709013,45.78149
2023-189506,2023-09-12,000001,Vente,226550,,,LE BUISSON,B004,16310,16398,Verneuil,16,,,163980000B0649,,,,,,,,,,,,,0,,,,,J,jardins,,,1150,0.705835,45.774905
2023-189506,2023-09-12,000001,Vente,226550,14,,IMP DU BUISSON,0080,16310,16398,Verneuil,16,,,163980000B0651,,,,,,,,,,,,,0,1,Maison,83,3,S,sols,,,729,0.705582,45.774971
2023-191752,2023-12-01,000002,Vente,100,,,LE BUISSON,B004,16310,16398,Verneuil,16,,,163980000B0894,,,,,,,,,,,,,0,,,,,S,sols,,,40,,
