id_mutation,date_mutation,numero_disposition,nature_mutation,valeur_fonciere,adresse_numero,adresse_suffixe,adresse_nom_voie,adresse_code_voie,code_postal,code_commune,nom_commune,code_departement,ancien_code_commune,ancien_nom_commune,id_parcelle,ancien_id_parcelle,numero_volume,lot1_numero,lot1_surface_carrez,lot2_numero,lot2_surface_carrez,lot3_numero,lot3_surface_carrez,lot4_numero,lot4_surface_carrez,lot5_numero,lot5_surface_carrez,nombre_lots,code_type_local,type_local,surface_reelle_bati,nombre_pieces_principales,code_nature_culture,nature_culture,code_nature_culture_speciale,nature_culture_speciale,surface_terrain,longitude,latitude
2023-192565,2023-01-06,000001,Vente,320000,15,,RTE DES OUILLIERES,0036,17870,17065,Breuil-Magné,17,,,17065000AI0092,,,,,,,,,,,,,0,4,Local industriel. commercial ou assimilé,1900,0,AG,terrains d'agrément,,,500,-0.960308,45.975977
2023-192565,2023-01-06,000001,Vente,320000,15,,RTE DES OUILLIERES,0036,17870,17065,Breuil-Magné,17,,,17065000AI0092,,,,,,,,,,,,,0,4,Local industriel. commercial ou assimilé,1900,0,S,sols,,,1400,-0.960308,45.975977
2023-192926,2023-01-23,000001,Vente,150000,,,SOUS LIRON,B133,17870,17065,Breuil-Magné,17,,,170650000A0337,,,,,,,,,,,,,0,,,,,P,prés,,,14080,-0.992144,46.004144
2023-192926,2023-01-23,000001,Vente,150000,,,SOUS LIRON,B133,17870,17065,Breuil-Magné,17,,,170650000A0341,,,,,,,,,,,,,0,,,,,P,prés,,,27720,-0.991375,46.005751
2023-192926,2023-01-23,000001,Vente,150000,,,SOUS LIRON,B133,17870,17065,Breuil-Magné,17,,,170650000A0349,,,,,,,,,,,,,0,,,,,P,prés,,,37180,-0.987841,46.008427
2023-192926,2023-01-23,000001,Vente,150000,,,SOUS LIRON,B133,17870,17065,Breuil-Magné,17,,,170650000A0350,,,,,,,,,,,,,0,,,,,P,prés,,,28640,-0.986693,46.009234
2023-192926,2023-01-23,000001,Vente,150000,,,PRES DU VIGNEAU,B124,17870,17065,Breuil-Magné,17,,,170650000A0506,,,,,,,,,,,,,0,,,,,P,prés,,,13035,-0.959558,46.017661
2023-192926,2023-01-23,000001,Vente,150000,,,PRES DU VIGNEAU,B124,17870,17065,Breuil-Magné,17,,,170650000A0507,,,,,,,,,,,,,0,,,,,P,prés,,,63185,-0.961374,46.01711
2023-192926,2023-01-23,000001,Vente,150000,,,PRES DU VIGNEAU,B124,17870,17065,Breuil-Magné,17,,,170650000A0511,,,,,,,,,,,,,0,,,,,P,prés,,,48240,-0.964404,46.01454
2023-192926,2023-01-23,000001,Vente,150000,,,PRES DU VIGNEAU,B124,17870,17065,Breuil-Magné,17,,,170650000A0512,,,,,,,,,,,,,0,,,,,P,prés,,,51280,-0.966673,46.016152
2023-192926,2023-01-23,000001,Vente,150000,,,PRES DU VIGNEAU,B124,17870,17065,Breuil-Magné,17,,,170650000A0515,,,,,,,,,,,,,0,,,,,P,prés,,,2055,-0.966137,46.018189
2023-192926,2023-01-23,000001,Vente,150000,,,PRES DU VIGNEAU,B124,17870,17065,Breuil-Magné,17,,,170650000A0516,,,,,,,,,,,,,0,,,,,P,prés,,,58700,-0.967603,46.019017
2023-192926,2023-01-23,000001,Vente,150000,,,PRES DU VIGNEAU,B124,17870,17065,Breuil-Magné,17,,,170650000A0518,,,,,,,,,,,,,0,,,,,P,prés,,,2000,-0.967749,46.016796
2023-192926,2023-01-23,000001,Vente,150000,,,MARAIS DU ROY,B095,17870,17065,Breuil-Magné,17,,,170650000A0591,,,,,,,,,,,,,0,,,,,P,prés,,,7685,-0.984469,46.027585
2023-192926,2023-01-23,000001,Vente,150000,,,MARAIS DU ROY,B095,17870,17065,Breuil-Magné,17,,,170650000A0599,,,,,,,,,,,,,0,,,,,P,prés,,,29560,-0.986167,46.025332
2023-192926,2023-01-23,000001,Vente,150000,,,MARAIS DU ROY,B095,17870,17065,Breuil-Magné,17,,,170650000A0636,,,,,,,,,,,,,0,,,,,P,prés,,,38665,-0.974362,46.023672
2023-192926,2023-01-23,000001,Vente,150000,,,MARAIS DU ROY,B095,17870,17065,Breuil-Magné,17,,,170650000A0637,,,,,,,,,,,,,0,,,,,P,prés,,,24887,-0.972538,46.024565
2023-192926,2023-01-23,000001,Vente,150000,,,MARAIS DU ROY,B095,17870,17065,Breuil-Magné,17,,,170650000A0638,,,,,,,,,,,,,0,,,,,P,prés,,,41250,-0.972465,46.023192
2023-192926,2023-01-23,000001,Vente,150000,,,MARAIS DU ROY,B095,17870,17065,Breuil-Magné,17,,,170650000A0642,,,,,,,,,,,,,0,,,,,P,prés,,,21335,-0.970988,46.021573
2023-192926,2023-01-23,000001,Vente,150000,,,PRE COUILLEAU,B113,17870,17065,Breuil-Magné,17,,,170650000A0652,,,,,,,,,,,,,0,,,,,P,prés,,,16075,-0.97302,46.021752
2023-192926,2023-01-23,000001,Vente,150000,,,PRE COUILLEAU,B113,17870,17065,Breuil-Magné,17,,,170650000A0655,,,,,,,,,,,,,0,,,,,P,prés,,,13155,-0.975884,46.020847
2023-192926,2023-01-23,000001,Vente,150000,,,PRE COUILLEAU,B113,17870,17065,Breuil-Magné,17,,,170650000A0656,,,,,,,,,,,,,0,,,,,P,prés,,,3860,-0.976972,46.021168
2023-192926,2023-01-23,000001,Vente,150000,,,PRE COUILLEAU,B113,17870,17065,Breuil-Magné,17,,,170650000A0657,,,,,,,,,,,,,0,,,,,P,prés,,,30700,-0.978374,46.019309
2023-192926,2023-01-23,000001,Vente,150000,,,MARAIS DE LA LANCE,B094,17870,17065,Breuil-Magné,17,,,170650000A0685,,,,,,,,,,,,,0,,,,,BT,taillis simples,,,28890,-0.963398,46.022851
2023-192926,2023-01-23,000001,Vente,150000,,,MARAIS DE LA LANCE,B094,17870,17065,Breuil-Magné,17,,,170650000A0688,,,,,,,,,,,,,0,,,,,P,prés,,,3480,-0.959732,46.022654
2023-192926,2023-01-23,000001,Vente,150000,,,MARAIS DE LA LANCE,B094,17870,17065,Breuil-Magné,17,,,170650000A0690,,,,,,,,,,,,,0,,,,,P,prés,,,27790,-0.956841,46.021768
2023-192926,2023-01-23,000001,Vente,150000,,,MARAIS DE LA LANCE,B094,17870,17065,Breuil-Magné,17,,,170650000A0691,,,,,,,,,,,,,0,,,,,P,prés,,,2125,-0.956132,46.021936
2023-192926,2023-01-23,000001,Vente,150000,,,MARAIS DE LA LANCE,B094,17870,17065,Breuil-Magné,17,,,170650000A0692,,,,,,,,,,,,,0,,,,,P,prés,,,1705,-0.95654,46.019178
2023-192926,2023-01-23,000001,Vente,150000,,,MARAIS DE LA LANCE,B094,17870,17065,Breuil-Magné,17,,,170650000A0693,,,,,,,,,,,,,0,,,,,P,prés,,,6735,-0.956819,46.019243
2023-192926,2023-01-23,000001,Vente,150000,,,MARAIS DE LA LANCE,B094,17870,17065,Breuil-Magné,17,,,170650000A0694,,,,,,,,,,,,,0,,,,,P,prés,,,2630,-0.957127,46.018828
2023-192926,2023-01-23,000001,Vente,150000,,,MARAIS DE LA LANCE,B094,17870,17065,Breuil-Magné,17,,,170650000A0695,,,,,,,,,,,,,0,,,,,P,prés,,,16700,-0.957634,46.017751
2023-192926,2023-01-23,000001,Vente,150000,,,MARAIS DE LA LANCE,B094,17870,17065,Breuil-Magné,17,,,170650000A0696,,,,,,,,,,,,,0,,,,,BT,taillis simples,,,9540,-0.958616,46.018343
2023-192926,2023-01-23,000001,Vente,150000,5017,,LA LANCE,B083,17870,17065,Breuil-Magné,17,,,170650000A0697,,,,,,,,,,,,,0,1,Maison,92,3,S,sols,,,12915,-0.957634,46.019314
2023-192926,2023-01-23,000001,Vente,150000,,,COTE DE LA LANCE,B046,17870,17065,Breuil-Magné,17,,,170650000A0698,,,,,,,,,,,,,0,,,,,T,terres,,,206517,-0.961603,46.021148
2023-192926,2023-01-23,000001,Vente,150000,,,COTE DE LA LANCE,B046,17870,17065,Breuil-Magné,17,,,170650000A0698,,,,,,,,,,,,,0,,,,,T,terres,,,103258,-0.961603,46.021148
2023-192926,2023-01-23,000001,Vente,150000,,,COTE DE LA LANCE,B046,17870,17065,Breuil-Magné,17,,,170650000A0699,,,,,,,,,,,,,0,,,,,P,prés,,,3595,-0.96774,46.021256
2023-192926,2023-01-23,000001,Vente,150000,,,COTE DE LA LANCE,B046,17870,17065,Breuil-Magné,17,,,170650000A0700,,,,,,,,,,,,,0,,,,,P,prés,,,2590,-0.966838,46.022483
2023-192926,2023-01-23,000001,Vente,150000,,,MARAIS DE LA LANCE,B094,17870,17065,Breuil-Magné,17,,,170650000A0743,,,,,,,,,,,,,0,,,,,P,prés,,,21010,-0.957751,46.022946
2023-192926,2023-01-23,000001,Vente,150000,,,SOUS LIRON,B133,17870,17065,Breuil-Magné,17,,,170650000A0854,,,,,,,,,,,,,0,,,,,P,prés,,,27455,-0.986251,46.012033
2023-193080,2023-01-27,000001,Vente,246000,3,,RTE DE BEAUREGARD,0006,17870,17065,Breuil-Magné,17,,,17065000AC0154,,,,,,,,,,,,,0,1,Maison,114,5,AG,terrains d'agrément,,,548,-0.962078,45.987412
2023-193080,2023-01-27,000001,Vente,246000,3,,RTE DE BEAUREGARD,0006,17870,17065,Breuil-Magné,17,,,17065000AC0154,,,,,,,,,,,,,0,1,Maison,114,5,S,sols,,,1000,-0.962078,45.987412
2023-194869,2023-03-21,000001,Vente,509755,18,,RUE DU STADE,0042,17870,17065,Breuil-Magné,17,,,17065000AA0253,,,,,,,,,,,,,0,,,,,T,terres,,,27,-0.962136,45.980862
2023-194869,2023-03-21,000001,Vente,509755,2,,IMP DU CLOS DES OUILLIERES,0043,17870,17065,Breuil-Magné,17,,,17065000AA0258,,,,,,,,,,,,,0,3,Dépendance,,0,S,sols,,,643,-0.961887,45.980848
2023-194869,2023-03-21,000001,Vente,509755,2,,IMP DU CLOS DES OUILLIERES,0043,17870,17065,Breuil-Magné,17,,,17065000AA0258,,,,,,,,,,,,,0,3,Dépendance,,0,S,sols,,,643,-0.961887,45.980848
2023-194869,2023-03-21,000001,Vente,509755,2,,IMP DU CLOS DES OUILLIERES,0043,17870,17065,Breuil-Magné,17,,,17065000AA0258,,,,,,,,,,,,,0,1,Maison,150,5,S,sols,,,643,-0.961887,45.980848
2023-195507,2023-03-28,000002,Vente,3927,,,LA FONTAINE,B063,17870,17065,Breuil-Magné,17,,,17065000AI0108,,,,,,,,,,,,,0,,,,,P,prés,,,238,-0.961477,45.975768
2023-195812,2023-04-06,000001,Vente,322000,9,,RUE DE LA JAVIRE,0037,17870,17065,Breuil-Magné,17,,,17065000AC0090,,,,,,,,,,,,,0,1,Maison,102,4,S,sols,,,549,-0.962491,45.987765
2023-195966,2023-04-06,000001,Vente,27174,,,LES QUARANTE JOURNAUX,B127,17870,17065,Breuil-Magné,17,,,170650000B0261,,,,,,,,,,,,,0,,,,,T,terres,,,37680,-0.96445,46.004099
2023-195966,2023-04-06,000001,Vente,27174,,,LES QUARANTE JOURNAUX,B127,17870,17065,Breuil-Magné,17,,,170650000B0262,,,,,,,,,,,,,0,,,,,T,terres,,,30255,-0.966787,46.005026
2023-196308,2023-04-07,000002,Echange,9652,,,PRES DU VIGNEAU,B124,17870,17065,Breuil-Magné,17,,,170650000A0514,,,,,,,,,,,,,0,,,,,P,prés,,,47575,-0.964667,46.01809
2023-196403,2023-05-05,000001,Vente,260000,16,,RTE DU BOIS DU FOUR,0013,17870,17065,Breuil-Magné,17,,,17065000AB0009,,,,,,,,,,,,,0,1,Maison,90,4,S,sols,,,1045,-0.964245,45.980852
2023-196613,2023-05-16,000001,Vente,100000,58,,RUE DES FORGERONS,0029,17870,17065,Breuil-Magné,17,,,17065000AB0093,,,,,,,,,,,,,0,1,Maison,97,5,S,sols,,,158,-0.959402,45.985023
2023-196688,2023-05-12,000001,Vente,265300,70,,RUE DES FORGERONS,0029,17870,17065,Breuil-Magné,17,,,17065000AB0088,,,,,,,,,,,,,0,1,Maison,100,5,J,jardins,,,1189,-0.960512,45.985418
2023-196688,2023-05-12,000001,Vente,265300,70,,RUE DES FORGERONS,0029,17870,17065,Breuil-Magné,17,,,17065000AB0088,,,,,,,,,,,,,0,1,Maison,100,5,S,sols,,,700,-0.960512,45.985418
2023-197108,2023-05-09,000001,Vente,100000,,,LE BROCHIN,B024,17870,17065,Breuil-Magné,17,,,17065000AD0117,,,,,,,,,,,,,0,,,,,P,prés,,,737,-0.957446,45.984059
2023-197108,2023-05-09,000001,Vente,100000,,,CHE DE GAUPUT,0022,17870,17065,Breuil-Magné,17,,,17065000AD0119,,,,,,,,,,,,,0,,,,,T,terres,,,4070,-0.957404,45.983684
2023-197271,2023-05-25,000001,Vente,336085,18,,RTE DU BOIS RAMBAUD,0015,17870,17065,Breuil-Magné,17,,,17065000AE0032,,,,,,,,,,,,,0,1,Maison,133,6,S,sols,,,2494,-0.953291,45.979921
2023-197271,2023-05-25,000001,Vente,336085,18,,RTE DU BOIS RAMBAUD,0015,17870,17065,Breuil-Magné,17,,,17065000AE0032,,,,,,,,,,,,,0,1,Maison,133,6,J,jardins,,,2597,-0.953291,45.979921
2023-197361,2023-05-25,000001,Vente,81000,,,LE BOURG,B023,17870,17065,Breuil-Magné,17,,,17065000AB0240,,,,,,,,,,,,,0,,,,,J,jardins,,,306,-0.959745,45.983208
2023-197361,2023-05-25,000001,Vente,81000,34,,RUE DES FORGERONS,0029,17870,17065,Breuil-Magné,17,,,17065000AB0284,,,,,,,,,,,,,0,,,,,AG,terrains d'agrément,,,505,-0.959764,45.983349
2023-197361,2023-05-25,000001,Vente,81000,,,RUE DU GRAND LOGIS,0035,17870,17065,Breuil-Magné,17,,,17065000AB0356,,,,,,,,,,,,,0,,,,,S,sols,,,14,-0.959753,45.983465
2023-197686,2023-06-09,000001,Vente,185000,36,,RUE DE L EGLISE,0027,17870,17065,Breuil-Magné,17,,,17065000AA0289,,,,,,,,,,,,,0,1,Maison,82,4,S,sols,,,774,-0.956995,45.979189
2023-197856,2023-05-31,000001,Vente,223200,4,,RUE DES FRENES,0070,17870,17065,Breuil-Magné,17,,,17065000AD0238,,,,,,,,,,,,,0,1,Maison,73,3,S,sols,,,372,-0.957276,45.985073
2023-197931,2023-06-12,000001,Vente,400000,21,B,RTE DE LOIRE LES MARAIS,0005,17870,17065,Breuil-Magné,17,,,17065000AD0246,,,,,,,,,,,,,0,3,Dépendance,,0,,,,,,-0.9549,45.987472
2023-197931,2023-06-12,000001,Vente,400000,21,B,RTE DE LOIRE LES MARAIS,0005,17870,17065,Breuil-Magné,17,,,17065000AD0246,,,,,,,,,,,,,0,1,Maison,265,7,,,,,,-0.9549,45.987472
2023-198040,2023-06-07,000001,Vente,180000,,,RTE DES SABLIERES ET DU PERE,0040,17870,17065,Breuil-Magné,17,,,170650000A0316,,,,,,,,,,,,,0,,,,,S,sols,,,1040,-0.983103,45.986488
2023-198040,2023-06-07,000001,Vente,180000,,,RTE DES SABLIERES ET DU PERE,0040,17870,17065,Breuil-Magné,17,,,170650000A0316,,,,,,,,,,,,,0,,,,,P,prés,,,15655,-0.983103,45.986488
2023-198040,2023-06-07,000001,Vente,180000,,,RTE DES SABLIERES ET DU PERE,0040,17870,17065,Breuil-Magné,17,,,170650000A0317,,,,,,,,,,,,,0,,,,,P,prés,,,1401,-0.982483,45.986226
2023-198040,2023-06-07,000001,Vente,180000,,,RTE DES SABLIERES ET DU PERE,0040,17870,17065,Breuil-Magné,17,,,170650000A0317,,,,,,,,,,,,,0,,,,,S,sols,,,144,-0.982483,45.986226
2023-198040,2023-06-07,000001,Vente,180000,,,LES SABLIERES,B144,17870,17065,Breuil-Magné,17,,,170650000A0325,,,,,,,,,,,,,0,,,,,S,sols,,,45,-0.982891,45.985258
2023-198040,2023-06-07,000001,Vente,180000,,,LES SABLIERES,B144,17870,17065,Breuil-Magné,17,,,170650000A0325,,,,,,,,,,,,,0,,,,,P,prés,,,3260,-0.982891,45.985258
2023-198040,2023-06-07,000001,Vente,180000,,,LES SABLIERES,B144,17870,17065,Breuil-Magné,17,,,170650000A0326,,,,,,,,,,,,,0,,,,,P,prés,,,960,-0.983007,45.985528
2023-198040,2023-06-07,000001,Vente,180000,,,LES SABLIERES,B144,17870,17065,Breuil-Magné,17,,,170650000A0327,,,,,,,,,,,,,0,,,,,P,prés,,,2865,-0.983265,45.985747
2023-198040,2023-06-07,000001,Vente,180000,26,,RTE DES SABLIERES ET DU PERE,0040,17870,17065,Breuil-Magné,17,,,170650000A0876,,,,,,,,,,,,,0,1,Maison,180,4,S,sols,,,4113,-0.982612,45.986123
2023-198040,2023-06-07,000001,Vente,180000,26,,RTE DES SABLIERES ET DU PERE,0040,17870,17065,Breuil-Magné,17,,,170650000A0876,,,,,,,,,,,,,0,1,Maison,90,2,S,sols,,,4113,-0.982612,45.986123
2023-198040,2023-06-07,000001,Vente,180000,26,,RTE DES SABLIERES ET DU PERE,0040,17870,17065,Breuil-Magné,17,,,170650000A0877,,,,,,,,,,,,,0,,,,,S,sols,,,985,-0.981935,45.986144
2023-198040,2023-06-07,000001,Vente,180000,,,LA GAILLARDERIE,B066,17870,17065,Breuil-Magné,17,,,170650000A0879,,,,,,,,,,,,,0,,,,,T,terres,,,875,-0.982072,45.985549
2023-198040,2023-06-07,000001,Vente,180000,,,LES SABLIERES,B144,17870,17065,Breuil-Magné,17,,,170650000A0881,,,,,,,,,,,,,0,,,,,S,sols,,,80,-0.982419,45.985451
2023-198040,2023-06-07,000001,Vente,180000,,,LES SABLIERES,B144,17870,17065,Breuil-Magné,17,,,170650000A0881,,,,,,,,,,,,,0,,,,,J,jardins,,,1490,-0.982419,45.985451
2023-198040,2023-06-07,000001,Vente,180000,,,LES SABLIERES,B144,17870,17065,Breuil-Magné,17,,,170650000A0883,,,,,,,,,,,,,0,,,,,P,prés,,,687,-0.98276,45.984928
2023-198040,2023-06-07,000001,Vente,180000,,,LES SABLIERES,B144,17870,17065,Breuil-Magné,17,,,170650000A0940,,,,,,,,,,,,,0,,,,,T,terres,,,24507,-0.980961,45.986478
2023-198040,2023-06-07,000001,Vente,180000,,,LES SABLIERES,B144,17870,17065,Breuil-Magné,17,,,170650000A0940,,,,,,,,,,,,,0,,,,,S,sols,,,1000,-0.980961,45.986478
2023-198111,2023-06-21,000001,Vente,90000,,,LE BOURG,B023,17870,17065,Breuil-Magné,17,,,17065000AA0105,,,,,,,,,,,,,0,,,,,J,jardins,,,126,-0.958568,45.981174
2023-198111,2023-06-21,000001,Vente,90000,10,,RUE DE L EGLISE,0027,17870,17065,Breuil-Magné,17,,,17065000AA0111,,,,,,,,,,,,,0,1,Maison,77,4,S,sols,,,106,-0.958158,45.981441
2023-199125,2023-07-13,000002,Vente,2500,,,LA PERCHE,B101,17870,17065,Breuil-Magné,17,,,170650000Y0306,,,,,,,,,,,,,0,,,,,T,terres,,,4150,-0.964681,45.994107
2023-199358,2023-07-20,000001,Vente,260000,13,,RTE DES SABLIERES ET DU PERE,0040,17870,17065,Breuil-Magné,17,,,170650000Z0089,,,,,,,,,,,,,0,1,Maison,106,5,S,sols,,,1202,-0.965323,45.986424
2023-199569,2023-07-22,000001,Vente,356350,10,,RUE DE L ANCIEN RELAIS,0008,17870,17065,Breuil-Magné,17,,,17065000AH0023,,,,,,,,,,,,,0,1,Maison,186,4,S,sols,,,355,-0.948541,45.975567
2023-199746,2023-07-19,000001,Vente,170000,1,B,RTE DE LA GRIMONNIERE,0032,17870,17065,Breuil-Magné,17,,,17065000AH0168,,,,,,,,,,,,,0,1,Maison,65,2,S,sols,,,269,-0.954474,45.9736
2023-199746,2023-07-19,000001,Vente,170000,,,LA GRIMONIERE,B075,17870,17065,Breuil-Magné,17,,,17065000AH0172,,,,,,,,,,,,,0,,,,,T,terres,,,153,-0.954481,45.973697
2023-200222,2023-08-01,000001,Vente,175000,3,,RTE DU CADORET,0020,17870,17065,Breuil-Magné,17,,,170650000Z0030,,,,,,,,,,,,,0,3,Dépendance,,0,J,jardins,,,2500,-0.970908,45.982669
2023-200222,2023-08-01,000001,Vente,175000,3,,RTE DU CADORET,0020,17870,17065,Breuil-Magné,17,,,170650000Z0030,,,,,,,,,,,,,0,1,Maison,102,5,T,terres,,,11280,-0.970908,45.982669
2023-200222,2023-08-01,000001,Vente,175000,3,,RTE DU CADORET,0020,17870,17065,Breuil-Magné,17,,,170650000Z0030,,,,,,,,,,,,,0,3,Dépendance,,0,T,terres,,,11280,-0.970908,45.982669
2023-200222,2023-08-01,000001,Vente,175000,3,,RTE DU CADORET,0020,17870,17065,Breuil-Magné,17,,,170650000Z0030,,,,,,,,,,,,,0,1,Maison,102,5,S,sols,,,700,-0.970908,45.982669
2023-200222,2023-08-01,000001,Vente,175000,3,,RTE DU CADORET,0020,17870,17065,Breuil-Magné,17,,,170650000Z0030,,,,,,,,,,,,,0,3,Dépendance,,0,S,sols,,,700,-0.970908,45.982669
2023-200222,2023-08-01,000001,Vente,175000,3,,RTE DU CADORET,0020,17870,17065,Breuil-Magné,17,,,170650000Z0030,,,,,,,,,,,,,0,1,Maison,102,5,J,jardins,,,2500,-0.970908,45.982669
2023-200616,2023-08-31,000001,Vente,140000,58,,RUE DES FORGERONS,0029,17870,17065,Breuil-Magné,17,,,17065000AB0093,,,,,,,,,,,,,0,1,Maison,97,5,S,sols,,,158,-0.959402,45.985023
2023-201549,2023-09-13,000001,Vente,362000,21,,RUE DE LA JAVIRE,0037,17870,17065,Breuil-Magné,17,,,17065000AC0096,,,,,,,,,,,,,0,1,Maison,146,6,S,sols,,,593,-0.962158,45.988423
2023-202240,2023-10-10,000001,Vente,229000,8,,RTE DES OUILLIERES,0036,17870,17065,Breuil-Magné,17,,,17065000AA0281,,,,,,,,,,,,,0,1,Maison,117,6,S,sols,,,500,-0.962439,45.977744
2023-202343,2023-10-10,000001,Vente,415500,13,,RTE DU BOIS DU FOUR,0013,17870,17065,Breuil-Magné,17,,,17065000AB0143,,,,,,,,,,,,,0,1,Maison,106,6,J,jardins,,,1349,-0.962723,45.981455
2023-202343,2023-10-10,000001,Vente,415500,13,,RTE DU BOIS DU FOUR,0013,17870,17065,Breuil-Magné,17,,,17065000AB0143,,,,,,,,,,,,,0,1,Maison,106,6,S,sols,,,800,-0.962723,45.981455
2023-202612,2023-10-05,000001,Vente,140000,,,LES RIVIERES,B128,17870,17065,Breuil-Magné,17,,,170650000B0108,,,,,,,,,,,,,0,,,,,P,prés,,,2750,-0.955156,46.003452
2023-202612,2023-10-05,000001,Vente,140000,,,LES RIVIERES,B128,17870,17065,Breuil-Magné,17,,,170650000B0109,,,,,,,,,,,,,0,,,,,P,prés,,,1900,-0.956062,46.003305
2023-202612,2023-10-05,000001,Vente,140000,,,LES RIVIERES,B128,17870,17065,Breuil-Magné,17,,,170650000B0111,,,,,,,,,,,,,0,,,,,P,prés,,,8405,-0.956847,46.003074
2023-202612,2023-10-05,000001,Vente,140000,29,,RTE DE CIRE,0024,17870,17065,Breuil-Magné,17,,,170650000B0112,,,,,,,,,,,,,0,3,Dépendance,,0,S,sols,,,9155,-0.955648,46.00286
2023-202612,2023-10-05,000001,Vente,140000,29,,RTE DE CIRE,0024,17870,17065,Breuil-Magné,17,,,170650000B0112,,,,,,,,,,,,,0,1,Maison,152,5,S,sols,,,9155,-0.955648,46.00286
2023-202684,2023-10-06,000001,Vente,296900,35,,RUE DES CHENES,0060,17870,17065,Breuil-Magné,17,,,17065000AD0231,,,,,,,,,,,,,0,1,Maison,93,4,S,sols,,,397,-0.957136,45.986273
2023-203162,2023-11-07,000001,Vente,170000,3,,RUE DU STADE,0042,17870,17065,Breuil-Magné,17,,,17065000AA0117,,,,,,,,,,,,,0,3,Dépendance,,0,S,sols,,,261,-0.958592,45.981798
2023-203162,2023-11-07,000001,Vente,170000,3,,RUE DU STADE,0042,17870,17065,Breuil-Magné,17,,,17065000AA0117,,,,,,,,,,,,,0,1,Maison,48,2,S,sols,,,261,-0.958592,45.981798
2023-203291,2023-11-09,000001,Vente,293500,1,,RUE DE L ABREUVOIR,0009,17870,17065,Breuil-Magné,17,,,17065000AA0030,,,,,,,,,,,,,0,1,Maison,95,4,S,sols,,,601,-0.961761,45.978413
2023-205073,2023-12-27,000001,Vente,74400,,,SAINT MUR,B131,17870,17065,Breuil-Magné,17,,,170650000B0720,,,,,,,,,,,,,0,,,,,T,terres,,,35482,-0.946517,46.012178
