id_mutation,date_mutation,numero_disposition,nature_mutation,valeur_fonciere,adresse_numero,adresse_suffixe,adresse_nom_voie,adresse_code_voie,code_postal,code_commune,nom_commune,code_departement,ancien_code_commune,ancien_nom_commune,id_parcelle,ancien_id_parcelle,numero_volume,lot1_numero,lot1_surface_carrez,lot2_numero,lot2_surface_carrez,lot3_numero,lot3_surface_carrez,lot4_numero,lot4_surface_carrez,lot5_numero,lot5_surface_carrez,nombre_lots,code_type_local,type_local,surface_reelle_bati,nombre_pieces_principales,code_nature_culture,nature_culture,code_nature_culture_speciale,nature_culture_speciale,surface_terrain,longitude,latitude
2023-205775,2023-01-12,000001,Vente,136000,,,PETITES ECURES,B094,17160,17239,Mons,17,,,172390000F0072,,,,,,,,,,,,,0,,,,,S,sols,,,75,-0.368375,45.80704
2023-205775,2023-01-12,000001,Vente,136000,,,PETITES ECURES,B094,17160,17239,Mons,17,,,172390000F0073,,,,,,,,,,,,,0,,,,,S,sols,,,100,-0.368379,45.80709
2023-205775,2023-01-12,000001,Vente,136000,,,PETITES ECURES,B094,17160,17239,Mons,17,,,172390000F0075,,,,,,,,,,,,,0,,,,,J,jardins,,,175,-0.368647,45.807562
2023-205775,2023-01-12,000001,Vente,136000,8,,RUE DES ROSIERS,0063,17160,17239,Mons,17,,,172390000F0079,,,,,,,,,,,,,0,3,Dépendance,,0,S,sols,,,100,-0.368697,45.807083
2023-205775,2023-01-12,000001,Vente,136000,8,,RUE DES ROSIERS,0063,17160,17239,Mons,17,,,172390000F0079,,,,,,,,,,,,,0,1,Maison,200,6,S,sols,,,100,-0.368697,45.807083
2023-205775,2023-01-12,000001,Vente,136000,,,PETITES ECURES,B094,17160,17239,Mons,17,,,172390000F0080,,,,,,,,,,,,,0,,,,,S,sols,,,222,-0.368673,45.807015
2023-205775,2023-01-12,000001,Vente,136000,,,PETITES ECURES,B094,17160,17239,Mons,17,,,172390000F0535,,,,,,,,,,,,,0,,,,,S,sols,,,65,-0.368811,45.807071
2023-205775,2023-01-12,000001,Vente,136000,,,PETITES ECURES,B094,17160,17239,Mons,17,,,172390000F0588,,,,,,,,,,,,,0,,,,,S,sols,,,1386,-0.368533,45.807342
2023-205775,2023-01-12,000001,Vente,136000,,,PETITES ECURES,B094,17160,17239,Mons,17,,,172390000F0589,,,,,,,,,,,,,0,,,,,J,jardins,,,47,-0.368735,45.807522
2023-205775,2023-01-12,000001,Vente,136000,,,PETITES ECURES,B094,17160,17239,Mons,17,,,172390000F0592,,,,,,,,,,,,,0,,,,,S,sols,,,308,-0.368672,45.807408
2023-206530,2023-02-24,000001,Vente,327000,8,,RUE DES MOULINS,0049,17160,17239,Mons,17,,,172390000F0571,,,,,,,,,,,,,0,1,Maison,190,8,S,sols,,,552,-0.369413,45.80641
2023-206530,2023-02-24,000001,Vente,327000,8,,RUE DES MOULINS,0049,17160,17239,Mons,17,,,172390000F0571,,,,,,,,,,,,,0,3,Dépendance,,0,S,sols,,,552,-0.369413,45.80641
2023-206530,2023-02-24,000001,Vente,327000,,,PETITES ECURES,B094,17160,17239,Mons,17,,,172390000F0572,,,,,,,,,,,,,0,,,,,S,sols,,,118,-0.369313,45.806466
2023-206530,2023-02-24,000001,Vente,327000,,,PETITES ECURES,B094,17160,17239,Mons,17,,,172390000F0573,,,,,,,,,,,,,0,,,,,S,sols,,,130,-0.369234,45.806439
2023-206749,2023-02-28,000002,Vente,437573,,,LA PIECE,B096,17160,17239,Mons,17,,,172390000C0126,,,,,,,,,,,,,0,,,,,VI,vignes,,,1700,-0.307471,45.808272
2023-206749,2023-02-28,000002,Vente,437573,,,LE PLANTIS,B105,17160,17239,Mons,17,,,172390000C0166,,,,,,,,,,,,,0,,,,,VI,vignes,,,2450,-0.305422,45.803774
2023-206749,2023-02-28,000002,Vente,437573,,,LE PLANTIS,B105,17160,17239,Mons,17,,,172390000C0167,,,,,,,,,,,,,0,,,,,VI,vignes,,,2370,-0.305508,45.803673
2023-206749,2023-02-28,000002,Vente,437573,,,LE PLANTIS,B105,17160,17239,Mons,17,,,172390000C0168,,,,,,,,,,,,,0,,,,,VI,vignes,,,1925,-0.305583,45.803585
2023-206749,2023-02-28,000002,Vente,437573,,,CHAUMES A MIDI,B039,17160,17239,Mons,17,,,172390000C0474,,,,,,,,,,,,,0,,,,,VI,vignes,,,13000,-0.312713,45.810182
2023-206749,2023-02-28,000002,Vente,437573,,,CHAUMES A MIDI,B039,17160,17239,Mons,17,,,172390000C0474,,,,,,,,,,,,,0,,,,,T,terres,,,10013,-0.312713,45.810182
2023-207147,2023-03-13,000001,Vente,110,,,PRE NOUVEAU,B119,17160,17239,Mons,17,,,172390000D1102,,,,,,,,,,,,,0,,,,,T,terres,,,236,-0.332167,45.793619
2023-207147,2023-03-13,000001,Vente,110,,,PRE NOUVEAU,B119,17160,17239,Mons,17,,,172390000D1104,,,,,,,,,,,,,0,,,,,T,terres,,,184,-0.332789,45.792786
2023-207540,2023-03-31,000001,Echange,11104,,,PONT VACHET,B108,17160,17239,Mons,17,,,172390000C0251,,,,,,,,,,,,,0,,,,,VI,vignes,,,1320,-0.301342,45.805241
2023-207540,2023-03-31,000001,Echange,11104,,,PONT VACHET,B108,17160,17239,Mons,17,,,172390000C0252,,,,,,,,,,,,,0,,,,,VI,vignes,,,2120,-0.301307,45.805094
2023-207540,2023-03-31,000001,Echange,11104,,,PONT VACHET,B108,17160,17239,Mons,17,,,172390000C0253,,,,,,,,,,,,,0,,,,,VI,vignes,,,760,-0.301217,45.804915
2023-207540,2023-03-31,000001,Echange,11104,,,PONT VACHET,B108,17160,17239,Mons,17,,,172390000C0254,,,,,,,,,,,,,0,,,,,VI,vignes,,,920,-0.30144,45.805006
2023-207540,2023-03-31,000001,Echange,11104,,,PONT VACHET,B108,17160,17239,Mons,17,,,172390000C0256,,,,,,,,,,,,,0,,,,,VI,vignes,,,2770,-0.301706,45.804956
2023-207540,2023-03-31,000001,Echange,11104,,,PONT VACHET,B108,17160,17239,Mons,17,,,172390000C0257,,,,,,,,,,,,,0,,,,,VI,vignes,,,1210,-0.301601,45.804781
2023-207540,2023-03-31,000001,Echange,11104,,,PONT VACHET,B108,17160,17239,Mons,17,,,172390000C0258,,,,,,,,,,,,,0,,,,,VI,vignes,,,1210,-0.301463,45.804594
2023-207540,2023-03-31,000001,Echange,11104,,,PONT VACHET,B108,17160,17239,Mons,17,,,172390000C0259,,,,,,,,,,,,,0,,,,,VI,vignes,,,2140,-0.301487,45.804519
2023-207540,2023-03-31,000001,Echange,11104,,,PONT VACHET,B108,17160,17239,Mons,17,,,172390000C0260,,,,,,,,,,,,,0,,,,,VI,vignes,,,2355,-0.301522,45.804373
2023-208408,2023-05-10,000001,Vente,294900,,,GRANDS LOPINS,B069,17160,17239,Mons,17,,,17239000WA0018,,,,,,,,,,,,,0,,,,,VI,vignes,,,828,-0.367661,45.819376
2023-208408,2023-05-10,000001,Vente,294900,,,LA GARENNE,B055,17160,17239,Mons,17,,,17239000WA0048,,,,,,,,,,,,,0,,,,,VI,vignes,,,2757,-0.366239,45.816407
2023-208408,2023-05-10,000001,Vente,294900,,,LES MECHANTS CHAMPS,B080,17160,17239,Mons,17,,,17239000WE0011,,,,,,,,,,,,,0,,,,,VI,vignes,,,1665,-0.362174,45.80967
2023-208408,2023-05-10,000001,Vente,294900,,,LES MECHANTS CHAMPS,B080,17160,17239,Mons,17,,,17239000WE0012,,,,,,,,,,,,,0,,,,,VI,vignes,,,24619,-0.362582,45.809415
2023-208408,2023-05-10,000001,Vente,294900,,,LE NOYER AVIER,B087,17160,17239,Mons,17,,,17239000WE0049,,,,,,,,,,,,,0,,,,,VI,vignes,,,3535,-0.36524,45.811609
2023-208696,2023-05-26,000001,Vente,75000,5170,,CHEVALLON,B044,17160,17239,Mons,17,,,172390000A0769,,,,,,,,,,,,,0,1,Maison,75,3,S,sols,,,391,-0.372228,45.817521
2023-208696,2023-05-26,000001,Vente,75000,,,CHEVALLON,B044,17160,17239,Mons,17,,,172390000A1236,,,,,,,,,,,,,0,,,,,T,terres,,,680,-0.371989,45.817386
2023-208773,2023-05-30,000001,Echange,1000,,,LE GRAND PRE,B059,17160,17239,Mons,17,,,172390000B0895,,,,,,,,,,,,,0,,,,,B,bois,,,2123,-0.339252,45.821182
2023-208774,2023-05-30,000002,Echange,2000,,,LA CHAGNEE,B028,17160,17239,Mons,17,,,172390000B1198,,,,,,,,,,,,,0,,,,,T,terres,,,34,-0.320775,45.805844
2023-208774,2023-05-30,000002,Echange,2000,,,CHAUMES DES BOEUFS,B041,17160,17239,Mons,17,,,172390000C0456,,,,,,,,,,,,,0,,,,,BT,taillis simples,,,5240,-0.316404,45.804179
2023-208774,2023-05-30,000002,Echange,2000,,,CHAUMES DES BOEUFS,B041,17160,17239,Mons,17,,,172390000C0487,,,,,,,,,,,,,0,,,,,T,terres,,,1415,-0.316097,45.805019
2023-208775,2023-05-30,000003,Echange,1000,,,GRAND MARAIS,B058,17160,17239,Mons,17,,,172390000B0318,,,,,,,,,,,,,0,,,,,P,prés,,,2123,-0.339225,45.82203
2023-208776,2023-05-30,000004,Echange,2000,,,GRAND MARAIS,B058,17160,17239,Mons,17,,,172390000B0897,,,,,,,,,,,,,0,,,,,B,bois,,,2123,-0.339212,45.822514
2023-208776,2023-05-30,000004,Echange,2000,,,GRAND MARAIS,B058,17160,17239,Mons,17,,,172390000B0898,,,,,,,,,,,,,0,,,,,B,bois,,,2123,-0.33922,45.823197
2023-208783,2023-05-30,000001,Vente,5000,,,LA CHAGNEE,B028,17160,17239,Mons,17,,,172390000B1177,,,,,,,,,,,,,0,,,,,S,sols,,,390,-0.32115,45.806143
2023-209277,2023-06-30,000002,Echange,6965.6,,,LA FIGEASSE,B050,17160,17239,Mons,17,,,17239000WC0140,,,,,,,,,,,,,0,,,,,T,terres,,,8278,-0.33211,45.811891
2023-209277,2023-06-30,000002,Echange,6965.6,,,LA FIGEASSE,B050,17160,17239,Mons,17,,,17239000WC0141,,,,,,,,,,,,,0,,,,,VI,vignes,,,419,-0.332078,45.812428
2023-209277,2023-06-30,000003,Echange,6965.6,,,LA FIGEASSE,B050,17160,17239,Mons,17,,,17239000WC0143,,,,,,,,,,,,,0,,,,,T,terres,,,8707,-0.332792,45.812978
2023-209648,2023-07-04,000002,Vente,2772,,,LA TACHERIE SUD,B138,17160,17239,Mons,17,,,172390000E1181,,,,,,,,,,,,,0,,,,,T,terres,,,153,-0.329955,45.798304
2023-209648,2023-07-04,000002,Vente,2772,,,LA TACHERIE SUD,B138,17160,17239,Mons,17,,,172390000E1183,,,,,,,,,,,,,0,,,,,T,terres,,,1,-0.329955,45.798367
2023-210335,2023-08-03,000001,Vente,58000,5192,,LA VRIGNOLLE,B145,17160,17239,Mons,17,,,172390000E0808,,,,,,,,,,,,,0,1,Maison,62,2,S,sols,,,163,-0.340955,45.809245
2023-210603,2023-08-11,000001,Vente,11626,,,PILLERIES,B104,17160,17239,Mons,17,,,172390000B0715,,,,,,,,,,,,,0,,,,,T,terres,,,1815,-0.325611,45.814039
2023-210603,2023-08-11,000001,Vente,11626,,,PILLERIES,B104,17160,17239,Mons,17,,,172390000B0716,,,,,,,,,,,,,0,,,,,T,terres,,,1815,-0.325468,45.814084
2023-210603,2023-08-11,000001,Vente,11626,,,PILLERIES,B104,17160,17239,Mons,17,,,172390000B0717,,,,,,,,,,,,,0,,,,,T,terres,,,2010,-0.325592,45.813736
2023-210603,2023-08-11,000001,Vente,11626,,,PILLERIES,B104,17160,17239,Mons,17,,,17239000WC0087,,,,,,,,,,,,,0,,,,,T,terres,,,8893,-0.327982,45.813884
2023-210648,2023-08-22,000001,Vente,12000,,,PIECES DES SABLES,B100,17160,17239,Mons,17,,,172390000B0584,,,,,,,,,,,,,0,,,,,T,terres,,,1680,-0.340168,45.81135
2023-211206,2023-09-06,000002,Echange,4000,,,CHEMIN DE COGNAC,B042,17160,17239,Mons,17,,,17239000WB0108,,,,,,,,,,,,,0,,,,,T,terres,,,6736,-0.352527,45.818799
2023-211206,2023-09-06,000003,Echange,4000,,,LA CROIX,B046,17160,17239,Mons,17,,,17239000WB0111,,,,,,,,,,,,,0,,,,,T,terres,,,6736,-0.352274,45.820868
2023-212456,2023-10-13,000001,Vente,120000,71,,RTE DE COGNAC,0018,17160,17239,Mons,17,,,172390000D1106,,,,,,,,,,,,,0,1,Maison,104,5,S,sols,,,365,-0.329066,45.797647
2023-212456,2023-10-13,000001,Vente,120000,71,,RTE DE COGNAC,0018,17160,17239,Mons,17,,,172390000D1106,,,,,,,,,,,,,0,1,Maison,104,5,T,terres,,,865,-0.329066,45.797647
2023-212456,2023-10-13,000001,Vente,120000,,,PIECE DU GRAND CHEMIN,B098,17160,17239,Mons,17,,,172390000D1171,,,,,,,,,,,,,0,,,,,T,terres,,,1543,-0.329324,45.79747
2023-212456,2023-10-13,000001,Vente,120000,,,PRE NOUVEAU,B119,17160,17239,Mons,17,,,172390000D1173,,,,,,,,,,,,,0,,,,,P,prés,,,350,-0.328965,45.797432
2023-212846,2023-11-20,000001,Vente,1650,,,PETITES ECURES,B094,17160,17239,Mons,17,,,172390000F0706,,,,,,,,,,,,,0,,,,,T,terres,,,3684,-0.368253,45.806276
2023-213495,2023-12-15,000001,Vente,175000,4,,LA FORET,B051,17160,17239,Mons,17,,,172390000D1212,,,,,,,,,,,,,0,1,Maison,134,6,J,jardins,MOTTE,Mottes,1437,-0.328638,45.798672
2023-213495,2023-12-15,000001,Vente,175000,4,,LA FORET,B051,17160,17239,Mons,17,,,172390000D1212,,,,,,,,,,,,,0,1,Maison,134,6,S,sols,,,800,-0.328638,45.798672
