id_mutation,date_mutation,numero_disposition,nature_mutation,valeur_fonciere,adresse_numero,adresse_suffixe,adresse_nom_voie,adresse_code_voie,code_postal,code_commune,nom_commune,code_departement,ancien_code_commune,ancien_nom_commune,id_parcelle,ancien_id_parcelle,numero_volume,lot1_numero,lot1_surface_carrez,lot2_numero,lot2_surface_carrez,lot3_numero,lot3_surface_carrez,lot4_numero,lot4_surface_carrez,lot5_numero,lot5_surface_carrez,nombre_lots,code_type_local,type_local,surface_reelle_bati,nombre_pieces_principales,code_nature_culture,nature_culture,code_nature_culture_speciale,nature_culture_speciale,surface_terrain,longitude,latitude
2023-228888,2023-03-03,000001,Vente,37240,,,SOUS ROCHELIMARD,B064,21400,21006,Aisey-sur-Seine,21,,,210060000A0034,,,,,,,,,,,,,0,,,,,BR,futaies résineuses,,,2184,4.589612,47.756153
2023-228888,2023-03-03,000001,Vente,37240,,,SOUS ROCHELIMARD,B064,21400,21006,Aisey-sur-Seine,21,,,210060000A0037,,,,,,,,,,,,,0,,,,,BR,futaies résineuses,,,4674,4.588459,47.756565
2023-228888,2023-03-03,000001,Vente,37240,,,LE COTEAU DU MOULIN,B025,21400,21006,Aisey-sur-Seine,21,,,210060000A0216,,,,,,,,,,,,,0,,,,,BT,taillis simples,,,44277,4.592379,47.747117
2023-228888,2023-03-03,000001,Vente,37240,,,LE COTEAU DU MOULIN,B025,21400,21006,Aisey-sur-Seine,21,,,210060000A0220,,,,,,,,,,,,,0,,,,,BR,futaies résineuses,,,3424,4.593405,47.747744
2023-228888,2023-03-03,000001,Vente,37240,,,LE COTEAU DU MOULIN,B025,21400,21006,Aisey-sur-Seine,21,,,210060000A0224,,,,,,,,,,,,,0,,,,,BT,taillis simples,,,3576,4.595658,47.745173
2023-228888,2023-03-03,000001,Vente,37240,,,LE COTEAU DU MOULIN,B025,21400,21006,Aisey-sur-Seine,21,,,210060000A0225,,,,,,,,,,,,,0,,,,,BR,futaies résineuses,,,10200,4.59611,47.745794
2023-228888,2023-03-03,000001,Vente,37240,,,LA BOLE,B006,21400,21006,Aisey-sur-Seine,21,,,210060000A0232,,,,,,,,,,,,,0,,,,,L,landes,,,12552,4.591557,47.748939
2023-228888,2023-03-03,000001,Vente,37240,,,LA BOLE,B006,21400,21006,Aisey-sur-Seine,21,,,210060000A0243,,,,,,,,,,,,,0,,,,,BR,futaies résineuses,,,3746,4.589919,47.750202
2023-228888,2023-03-03,000001,Vente,37240,,,LA BOLE,B006,21400,21006,Aisey-sur-Seine,21,,,210060000A0244,,,,,,,,,,,,,0,,,,,BR,futaies résineuses,,,6342,4.59042,47.74933
2023-228888,2023-03-03,000001,Vente,37240,,,LA BOLE,B006,21400,21006,Aisey-sur-Seine,21,,,210060000A0245,,,,,,,,,,,,,0,,,,,BT,taillis simples,,,16366,4.589245,47.750495
2023-228888,2023-03-03,000001,Vente,37240,,,DERRIERE LES RECY,B031,21400,21006,Aisey-sur-Seine,21,,,210060000C0003,,,,,,,,,,,,,0,,,,,BT,taillis simples,,,2896,4.556591,47.749438
2023-228888,2023-03-03,000001,Vente,37240,,,LE GRAND RECY,B039,21400,21006,Aisey-sur-Seine,21,,,210060000C0189,,,,,,,,,,,,,0,,,,,BR,futaies résineuses,,,8016,4.566805,47.749909
2023-228888,2023-03-03,000001,Vente,37240,,,LA BORDE,B008,21400,21006,Aisey-sur-Seine,21,,,210060000F0005,,,,,,,,,,,,,0,,,,,L,landes,,,88,4.539762,47.748649
2023-233095,2023-07-07,000001,Vente,3600,,,LE COTEAU D AVRIL,B024,21400,21006,Aisey-sur-Seine,21,,,210060000B0100,,,,,,,,,,,,,0,,,,,P,prés,,,2225,4.581213,47.747179
2023-233099,2023-06-16,000001,Vente,23500,3,B,GRANDE RUE,0080,21400,21006,Aisey-sur-Seine,21,,,21006000AA0136,,,,,,,,,,,,,0,3,Dépendance,,0,S,sols,,,507,4.57984,47.750529
2023-233099,2023-06-16,000001,Vente,23500,3,B,GRANDE RUE,0080,21400,21006,Aisey-sur-Seine,21,,,21006000AA0136,,,,,,,,,,,,,0,3,Dépendance,,0,S,sols,,,507,4.57984,47.750529
2023-233099,2023-06-16,000001,Vente,23500,3,B,GRANDE RUE,0080,21400,21006,Aisey-sur-Seine,21,,,21006000AA0136,,,,,,,,,,,,,0,1,Maison,133,5,S,sols,,,507,4.57984,47.750529
2023-233099,2023-06-16,000001,Vente,23500,9003,,GRANDE RUE,0080,21400,21006,Aisey-sur-Seine,21,,,21006000AA0140,,,,,,,,,,,,,0,,,,,S,sols,,,46,4.579728,47.750618
2023-233968,2023-06-30,000001,Vente,135000,,,LE MEIX DAMAS,B045,21400,21006,Aisey-sur-Seine,21,,,21006000AA0001,,,,,,,,,,,,,0,,,,,J,jardins,,,602,4.576129,47.748873
2023-233968,2023-06-30,000001,Vente,135000,20,B,RUE DE L EGLISE,0050,21400,21006,Aisey-sur-Seine,21,,,21006000AA0002,,,,,,,,,,,,,0,1,Maison,112,5,J,jardins,,,778,4.576643,47.748916
2023-233968,2023-06-30,000001,Vente,135000,20,B,RUE DE L EGLISE,0050,21400,21006,Aisey-sur-Seine,21,,,21006000AA0002,,,,,,,,,,,,,0,1,Maison,112,5,S,sols,,,830,4.576643,47.748916
2023-233968,2023-06-30,000001,Vente,135000,20,B,RUE DE L EGLISE,0050,21400,21006,Aisey-sur-Seine,21,,,21006000AA0002,,,,,,,,,,,,,0,3,Dépendance,,0,S,sols,,,830,4.576643,47.748916
2023-233968,2023-06-30,000001,Vente,135000,20,B,RUE DE L EGLISE,0050,21400,21006,Aisey-sur-Seine,21,,,21006000AA0002,,,,,,,,,,,,,0,3,Dépendance,,0,S,sols,,,830,4.576643,47.748916
2023-233968,2023-06-30,000001,Vente,135000,20,B,RUE DE L EGLISE,0050,21400,21006,Aisey-sur-Seine,21,,,21006000AA0002,,,,,,,,,,,,,0,3,Dépendance,,0,S,sols,,,830,4.576643,47.748916
2023-233968,2023-06-30,000001,Vente,135000,20,B,RUE DE L EGLISE,0050,21400,21006,Aisey-sur-Seine,21,,,21006000AA0002,,,,,,,,,,,,,0,3,Dépendance,,0,J,jardins,,,778,4.576643,47.748916
2023-233968,2023-06-30,000001,Vente,135000,20,B,RUE DE L EGLISE,0050,21400,21006,Aisey-sur-Seine,21,,,21006000AA0002,,,,,,,,,,,,,0,3,Dépendance,,0,J,jardins,,,778,4.576643,47.748916
2023-233968,2023-06-30,000001,Vente,135000,20,B,RUE DE L EGLISE,0050,21400,21006,Aisey-sur-Seine,21,,,21006000AA0002,,,,,,,,,,,,,0,3,Dépendance,,0,J,jardins,,,778,4.576643,47.748916
2023-233968,2023-06-30,000001,Vente,135000,,,LE MEIX DAMAS,B045,21400,21006,Aisey-sur-Seine,21,,,21006000AA0009,,,,,,,,,,,,,0,,,,,S,sols,,,103,4.57675,47.748482
2023-234173,2023-07-07,000001,Vente,15000,,,LE PARC,B046,21400,21006,Aisey-sur-Seine,21,,,210060000B0136,,,,,,,,,,,,,0,,,,,P,prés,,,49908,4.585934,47.740456
2023-239140,2023-11-20,000001,Vente,5000,,,LE MEIX DAMAS,B045,21400,21006,Aisey-sur-Seine,21,,,21006000AA0005,,,,,,,,,,,,,0,,,,,VE,vergers,,,364,4.576907,47.748894
2023-239763,2023-12-20,000001,Vente,1000,,,LE VILLAGE,B067,21400,21006,Aisey-sur-Seine,21,,,21006000AA0099,,,,,,,,,,,,,0,,,,,S,sols,,,148,4.579363,47.750394
