id_mutation,date_mutation,numero_disposition,nature_mutation,valeur_fonciere,adresse_numero,adresse_suffixe,adresse_nom_voie,adresse_code_voie,code_postal,code_commune,nom_commune,code_departement,ancien_code_commune,ancien_nom_commune,id_parcelle,ancien_id_parcelle,numero_volume,lot1_numero,lot1_surface_carrez,lot2_numero,lot2_surface_carrez,lot3_numero,lot3_surface_carrez,lot4_numero,lot4_surface_carrez,lot5_numero,lot5_surface_carrez,nombre_lots,code_type_local,type_local,surface_reelle_bati,nombre_pieces_principales,code_nature_culture,nature_culture,code_nature_culture_speciale,nature_culture_speciale,surface_terrain,longitude,latitude
2023-228473,2023-02-01,000001,Vente,195000,1,,RTE DE CITEAUX,0070,21170,21031,Aubigny-en-Plaine,21,,,21031000AB0105,,,,,,,,,,,,,0,1,Maison,103,4,S,sols,,,379,5.175642,47.130572
2023-228473,2023-02-01,000001,Vente,195000,1,,RTE DE CITEAUX,0070,21170,21031,Aubigny-en-Plaine,21,,,21031000AB0105,,,,,,,,,,,,,0,3,Dépendance,,0,S,sols,,,379,5.175642,47.130572
2023-228473,2023-02-01,000001,Vente,195000,,,LE VILLAGE,B061,21170,21031,Aubigny-en-Plaine,21,,,21031000AB0127,,,,,,,,,,,,,0,,,,,J,jardins,,,2,5.175702,47.130504
2023-228473,2023-02-01,000001,Vente,195000,,,LE VILLAGE,B061,21170,21031,Aubigny-en-Plaine,21,,,21031000AB0128,,,,,,,,,,,,,0,,,,,J,jardins,,,10,5.17575,47.130583
2023-228473,2023-02-01,000001,Vente,195000,,,LE VILLAGE,B061,21170,21031,Aubigny-en-Plaine,21,,,21031000AB0129,,,,,,,,,,,,,0,,,,,J,jardins,,,390,5.175872,47.130575
2023-228473,2023-02-01,000001,Vente,195000,,,LE VILLAGE,B061,21170,21031,Aubigny-en-Plaine,21,,,21031000AB0130,,,,,,,,,,,,,0,,,,,J,jardins,,,3,5.175745,47.130492
2023-228473,2023-02-01,000001,Vente,195000,,,LE VILLAGE,B061,21170,21031,Aubigny-en-Plaine,21,,,21031000AB0131,,,,,,,,,,,,,0,,,,,J,jardins,,,18,5.175919,47.13045
2023-228473,2023-02-01,000001,Vente,195000,,,LE VILLAGE,B061,21170,21031,Aubigny-en-Plaine,21,,,21031000AB0132,,,,,,,,,,,,,0,,,,,J,jardins,,,398,5.175769,47.130405
2023-228754,2023-02-21,000001,Vente,260000,20,B,RTE D'ESBARRES,0120,21170,21031,Aubigny-en-Plaine,21,,,21031000AC0278,,,,,,,,,,,,,0,1,Maison,102,4,S,sols,,,596,5.180379,47.128192
2023-228754,2023-02-21,000001,Vente,260000,20,B,RTE D'ESBARRES,0120,21170,21031,Aubigny-en-Plaine,21,,,21031000AC0278,,,,,,,,,,,,,0,3,Dépendance,,0,S,sols,,,596,5.180379,47.128192
2023-228754,2023-02-21,000001,Vente,260000,20,B,RTE D'ESBARRES,0120,21170,21031,Aubigny-en-Plaine,21,,,21031000AC0278,,,,,,,,,,,,,0,3,Dépendance,,0,S,sols,,,596,5.180379,47.128192
2023-228754,2023-02-21,000001,Vente,260000,20,B,RTE D'ESBARRES,0120,21170,21031,Aubigny-en-Plaine,21,,,21031000AC0279,,,,,,,,,,,,,0,,,,,S,sols,,,18,5.180709,47.128051
2023-228754,2023-02-21,000001,Vente,260000,20,B,RTE D'ESBARRES,0120,21170,21031,Aubigny-en-Plaine,21,,,21031000AC0280,,,,,,,,,,,,,0,,,,,J,jardins,,,123,5.180742,47.128031
2023-228754,2023-02-21,000001,Vente,260000,20,B,RTE D'ESBARRES,0120,21170,21031,Aubigny-en-Plaine,21,,,21031000AC0283,,,,,,,,,,,,,0,,,,,J,jardins,,,345,5.180311,47.128072
2023-230355,2023-04-19,000001,Vente,179000,3,,RUE DE L'EGLISE,0080,21170,21031,Aubigny-en-Plaine,21,,,21031000AB0078,,,,,,,,,,,,,0,1,Maison,99,4,S,sols,,,887,5.1771,47.133468
2023-231372,2023-05-10,000002,Vente,78000,,,LE VILLAGE,B061,21170,21031,Aubigny-en-Plaine,21,,,21031000AC0312,,,,,,,,,,,,,0,,,,,P,prés,,,1762,5.178983,47.130229
2023-231372,2023-05-10,000002,Vente,78000,,,LE VILLAGE,B061,21170,21031,Aubigny-en-Plaine,21,,,21031000AC0315,,,,,,,,,,,,,0,,,,,P,prés,,,46,5.177654,47.129997
2023-231372,2023-05-10,000002,Vente,78000,,,LE VILLAGE,B061,21170,21031,Aubigny-en-Plaine,21,,,21031000AC0317,,,,,,,,,,,,,0,,,,,P,prés,,,837,5.178444,47.130025
2023-234159,2023-06-01,000001,Vente,80000,,,LE VILLAGE,B061,21170,21031,Aubigny-en-Plaine,21,,,21031000AB0091,,,,,,,,,,,,,0,,,,,T,terres,,,1156,5.17591,47.131766
2023-234159,2023-06-01,000001,Vente,80000,24,,RUE PRINCIPALE,0210,21170,21031,Aubigny-en-Plaine,21,,,21031000AB0092,,,,,,,,,,,,,0,3,Dépendance,,0,S,sols,,,822,5.176385,47.131753
2023-234159,2023-06-01,000001,Vente,80000,24,,RUE PRINCIPALE,0210,21170,21031,Aubigny-en-Plaine,21,,,21031000AB0092,,,,,,,,,,,,,0,1,Maison,82,4,S,sols,,,822,5.176385,47.131753
2023-234657,2023-07-04,000001,Vente,248500,20,,RTE D'ESBARRES,0120,21170,21031,Aubigny-en-Plaine,21,,,21031000AC0277,,,,,,,,,,,,,0,3,Dépendance,,0,S,sols,,,2141,5.180681,47.128289
2023-234657,2023-07-04,000001,Vente,248500,20,,RTE D'ESBARRES,0120,21170,21031,Aubigny-en-Plaine,21,,,21031000AC0277,,,,,,,,,,,,,0,1,Maison,108,5,S,sols,,,2141,5.180681,47.128289
2023-236180,2023-09-29,000001,Vente,33975,,,EN BLANCHARD,B005,21170,21031,Aubigny-en-Plaine,21,,,21031000AB0242,,,,,,,,,,,,,0,,,,,VI,vignes,,,149,5.174908,47.131471
2023-236180,2023-09-29,000001,Vente,33975,,,EN BLANCHARD,B005,21170,21031,Aubigny-en-Plaine,21,,,21031000AB0246,,,,,,,,,,,,,0,,,,,T,terres,,,501,5.17514,47.131197
2023-236180,2023-09-29,000001,Vente,33975,,,EN BLANCHARD,B005,21170,21031,Aubigny-en-Plaine,21,,,21031000AB0248,,,,,,,,,,,,,0,,,,,T,terres,,,254,5.175213,47.131159
2023-236180,2023-09-29,000001,Vente,33975,,,EN BLANCHARD,B005,21170,21031,Aubigny-en-Plaine,21,,,21031000AB0252,,,,,,,,,,,,,0,,,,,T,terres,,,281,5.174793,47.131504
2023-236180,2023-09-29,000001,Vente,33975,,,EN BLANCHARD,B005,21170,21031,Aubigny-en-Plaine,21,,,21031000AB0253,,,,,,,,,,,,,0,,,,,T,terres,,,300,5.17502,47.131465
2023-236194,2023-09-29,000003,Vente,23675,,,EN BLANCHARD,B005,21170,21031,Aubigny-en-Plaine,21,,,21031000AB0241,,,,,,,,,,,,,0,,,,,VI,vignes,,,88,5.174888,47.131311
2023-236194,2023-09-29,000003,Vente,23675,,,EN BLANCHARD,B005,21170,21031,Aubigny-en-Plaine,21,,,21031000AB0245,,,,,,,,,,,,,0,,,,,T,terres,,,422,5.175081,47.131105
2023-236194,2023-09-29,000003,Vente,23675,,,EN BLANCHARD,B005,21170,21031,Aubigny-en-Plaine,21,,,21031000AB0251,,,,,,,,,,,,,0,,,,,T,terres,,,437,5.174911,47.13128
2023-238671,2023-11-20,000001,Vente,223600,,,EN GUILLERET,B037,21170,21031,Aubigny-en-Plaine,21,,,21031000ZD0127,,,,,,,,,,,,,0,,,,,S,sols,,,280,5.180385,47.130173
2023-238671,2023-11-20,000001,Vente,223600,15,,RUE BASSE,0030,21170,21031,Aubigny-en-Plaine,21,,,21031000ZD0129,,,,,,,,,,,,,0,1,Maison,88,4,S,sols,,,500,5.181501,47.130558
2023-238671,2023-11-20,000001,Vente,223600,15,,RUE BASSE,0030,21170,21031,Aubigny-en-Plaine,21,,,21031000ZD0129,,,,,,,,,,,,,0,1,Maison,88,4,J,jardins,,,719,5.181501,47.130558
2023-238671,2023-11-20,000001,Vente,223600,,,EN GUILLERET,B037,21170,21031,Aubigny-en-Plaine,21,,,21031000ZD0131,,,,,,,,,,,,,0,,,,,S,sols,,,244,5.18129,47.130295
2023-239859,2023-12-28,000001,Vente,70000,,,LA MANCHE,B041,21170,21031,Aubigny-en-Plaine,21,,,21031000ZC0023,,,,,,,,,,,,,0,,,,,BT,taillis simples,,,2657,5.170282,47.121859
