id_mutation,date_mutation,numero_disposition,nature_mutation,valeur_fonciere,adresse_numero,adresse_suffixe,adresse_nom_voie,adresse_code_voie,code_postal,code_commune,nom_commune,code_departement,ancien_code_commune,ancien_nom_commune,id_parcelle,ancien_id_parcelle,numero_volume,lot1_numero,lot1_surface_carrez,lot2_numero,lot2_surface_carrez,lot3_numero,lot3_surface_carrez,lot4_numero,lot4_surface_carrez,lot5_numero,lot5_surface_carrez,nombre_lots,code_type_local,type_local,surface_reelle_bati,nombre_pieces_principales,code_nature_culture,nature_culture,code_nature_culture_speciale,nature_culture_speciale,surface_terrain,longitude,latitude
2023-257412,2023-01-23,000001,Vente,13210,,,LA NAUTE,B120,23260,23017,Basville,23,,,230170000G0180,,,,,,,,,,,,,0,,,,,P,prés,,,9745,2.398202,45.855845
2023-257412,2023-01-23,000001,Vente,13210,,,CHARVAILLE,B039,23260,23017,Basville,23,,,230170000G0569,,,,,,,,,,,,,0,,,,,L,landes,,,32520,2.390939,45.85799
2023-257412,2023-01-23,000001,Vente,13210,,,SAINT ALVARD,B186,23260,23017,Basville,23,,,230170000G0632,,,,,,,,,,,,,0,,,,,BT,taillis simples,,,234,2.395872,45.858384
2023-257412,2023-01-23,000001,Vente,13210,,,PUY LAVAL,B169,23260,23017,Basville,23,,,230170000G0664,,,,,,,,,,,,,0,,,,,T,terres,,,348,2.389011,45.852004
2023-257412,2023-01-23,000001,Vente,13210,,,PUY LAVAL,B169,23260,23017,Basville,23,,,230170000G0666,,,,,,,,,,,,,0,,,,,T,terres,,,2455,2.388484,45.851849
2023-257412,2023-01-23,000001,Vente,13210,,,LA NAUTE,B120,23260,23017,Basville,23,,,230170000G0682,,,,,,,,,,,,,0,,,,,BT,taillis simples,,,6515,2.397037,45.854633
2023-257412,2023-01-23,000001,Vente,13210,,,LA NAUTE,B120,23260,23017,Basville,23,,,230170000G0684,,,,,,,,,,,,,0,,,,,P,prés,,,34610,2.397867,45.855621
2023-257412,2023-01-23,000001,Vente,13210,,,LA NAUTE,B120,23260,23017,Basville,23,,,230170000G0684,,,,,,,,,,,,,0,,,,,BT,taillis simples,,,4365,2.397867,45.855621
2023-257731,2023-03-07,000001,Vente,6000,18,,LES CHAUMETTES,B042,23260,23017,Basville,23,,,230170000B0512,,,,,,,,,,,,,0,1,Maison,31,1,S,sols,,,246,2.417978,45.87111
2023-257731,2023-03-07,000001,Vente,6000,18,,LES CHAUMETTES,B042,23260,23017,Basville,23,,,230170000B0512,,,,,,,,,,,,,0,3,Dépendance,,0,S,sols,,,246,2.417978,45.87111
2023-257731,2023-03-07,000001,Vente,6000,,,LES CHAUMETTES,B042,23260,23017,Basville,23,,,230170000B0513,,,,,,,,,,,,,0,,,,,J,jardins,,,763,2.41829,45.871025
2023-257814,2023-03-09,000001,Vente,23000,8,,LES FARGES,B077,23260,23017,Basville,23,,,230170000C0088,,,,,,,,,,,,,0,1,Maison,80,3,S,sols,,,275,2.412702,45.86549
2023-257814,2023-03-09,000001,Vente,23000,8,,LES FARGES,B077,23260,23017,Basville,23,,,230170000C0088,,,,,,,,,,,,,0,3,Dépendance,,0,S,sols,,,275,2.412702,45.86549
2023-257814,2023-03-09,000001,Vente,23000,8,,LES FARGES,B077,23260,23017,Basville,23,,,230170000C0088,,,,,,,,,,,,,0,3,Dépendance,,0,S,sols,,,275,2.412702,45.86549
2023-257814,2023-03-09,000001,Vente,23000,,,LES FARGES,B077,23260,23017,Basville,23,,,230170000C0089,,,,,,,,,,,,,0,,,,,J,jardins,,,560,2.412909,45.865579
2023-257851,2023-03-08,000001,Vente,850,,,LES BESSES,B010,23260,23017,Basville,23,,,230170000D0065,,,,,,,,,,,,,0,,,,,B,bois,,,2134,2.43732,45.867575
2023-257851,2023-03-08,000001,Vente,850,,,LES BESSES,B010,23260,23017,Basville,23,,,230170000D0065,,,,,,,,,,,,,0,,,,,BR,futaies résineuses,,,831,2.43732,45.867575
2023-259409,2023-06-23,000001,Vente,7200,,,PUY DE LA CHAUME,B159,23260,23017,Basville,23,,,230170000D0189,,,,,,,,,,,,,0,,,,,BR,futaies résineuses,,,7385,2.429391,45.848336
2023-260240,2023-08-31,000001,Vente,300,,,POMPIGNAT,B140,23260,23017,Basville,23,,,230170000G0272,,,,,,,,,,,,,0,,,,,S,sols,,,885,2.409725,45.852824
2023-260465,2023-10-09,000001,Vente,679,,,PUY DE LA PECHERIE,B160,23260,23017,Basville,23,,,230170000B0452,,,,,,,,,,,,,0,,,,,T,terres,,,1320,2.42712,45.872023
2023-260465,2023-10-09,000001,Vente,679,,,PUY DE LA PECHERIE,B160,23260,23017,Basville,23,,,230170000B0453,,,,,,,,,,,,,0,,,,,B,bois,,,2340,2.426188,45.872328
2023-260465,2023-10-09,000001,Vente,679,,,PUY DE LA PECHERIE,B160,23260,23017,Basville,23,,,230170000B0453,,,,,,,,,,,,,0,,,,,BR,futaies résineuses,,,585,2.426188,45.872328
2023-260592,2023-10-09,000001,Vente,5000,,,LES COMBES,B052,23260,23017,Basville,23,,,230170000G0209,,,,,,,,,,,,,0,,,,,P,prés,,,3050,2.397053,45.862155
2023-260592,2023-10-09,000001,Vente,5000,,,LA NAUTE,B120,23260,23017,Basville,23,,,230170000G0358,,,,,,,,,,,,,0,,,,,BT,taillis simples,,,2915,2.403843,45.853115
2023-260592,2023-10-09,000001,Vente,5000,,,LA NAUTE,B120,23260,23017,Basville,23,,,230170000G0362,,,,,,,,,,,,,0,,,,,P,prés,,,3360,2.40124,45.854147
2023-261348,2023-12-07,000002,Vente,500,,,LE ROSSIGNOL,B180,23260,23017,Basville,23,,,230170000E0125,,,,,,,,,,,,,0,,,,,B,bois,,,872,2.427073,45.842733
2023-261348,2023-12-07,000002,Vente,500,,,LE ROSSIGNOL,B180,23260,23017,Basville,23,,,230170000E0125,,,,,,,,,,,,,0,,,,,BT,taillis simples,,,218,2.427073,45.842733
