id_mutation,date_mutation,numero_disposition,nature_mutation,valeur_fonciere,adresse_numero,adresse_suffixe,adresse_nom_voie,adresse_code_voie,code_postal,code_commune,nom_commune,code_departement,ancien_code_commune,ancien_nom_commune,id_parcelle,ancien_id_parcelle,numero_volume,lot1_numero,lot1_surface_carrez,lot2_numero,lot2_surface_carrez,lot3_numero,lot3_surface_carrez,lot4_numero,lot4_surface_carrez,lot5_numero,lot5_surface_carrez,nombre_lots,code_type_local,type_local,surface_reelle_bati,nombre_pieces_principales,code_nature_culture,nature_culture,code_nature_culture_speciale,nature_culture_speciale,surface_terrain,longitude,latitude
2023-263078,2023-02-23,000001,Vente,1500,,,LE FORCHET,B026,24510,24327,Pezuls,24,,,243270000A0492,,,,,,,,,,,,,0,,,,,T,terres,,,2850,0.794723,44.913786
2023-263078,2023-02-23,000001,Vente,1500,,,LE FORCHET,B026,24510,24327,Pezuls,24,,,243270000A0498,,,,,,,,,,,,,0,,,,,BT,taillis simples,,,1425,0.794766,44.912246
2023-263284,2023-02-24,000001,Vente,212000,,,LE PEY,B038,24510,24327,Pezuls,24,,,243270000C0206,,,,,,,,,,,,,0,,,,,BT,taillis simples,,,2875,0.8037,44.8985
2023-263284,2023-02-24,000001,Vente,212000,63,,LE PEY,B038,24510,24327,Pezuls,24,,,243270000C0513,,,,,,,,,,,,,0,1,Maison,74,3,S,sols,,,800,0.802861,44.898058
2023-263284,2023-02-24,000001,Vente,212000,63,,LE PEY,B038,24510,24327,Pezuls,24,,,243270000C0513,,,,,,,,,,,,,0,1,Maison,74,3,BT,taillis simples,,,2530,0.802861,44.898058
2023-263284,2023-02-24,000001,Vente,212000,,,LE PEY,B038,24510,24327,Pezuls,24,,,243270000C0514,,,,,,,,,,,,,0,,,,,BT,taillis simples,,,3130,0.801905,44.89809
2023-263818,2023-02-17,000001,Vente,260000,,,LE PEY,B038,24510,24327,Pezuls,24,,,243270000C0210,,,,,,,,,,,,,0,,,,,BT,taillis simples,,,2790,0.805217,44.898116
2023-265333,2023-04-13,000001,Vente,205000,,,LE BOURG EST,B008,24510,24327,Pezuls,24,,,243270000A0401,,,,,,,,,,,,,0,,,,,J,jardins,,,460,0.80319,44.912655
2023-265333,2023-04-13,000001,Vente,205000,15,,LE BOURG EST,B008,24510,24327,Pezuls,24,,,243270000A0402,,,,,,,,,,,,,0,1,Maison,142,4,S,sols,,,260,0.803439,44.912575
2023-265333,2023-04-13,000001,Vente,205000,,,LE BOURG EST,B008,24510,24327,Pezuls,24,,,243270000A0403,,,,,,,,,,,,,0,,,,,J,jardins,,,400,0.803729,44.912483
2023-266928,2023-05-12,000001,Vente,160000,,,LA DREDIE NORD,B020,24510,24327,Pezuls,24,,,243270000A0433,,,,,,,,,,,,,0,,,,,T,terres,,,3410,0.803252,44.909961
2023-266928,2023-05-12,000001,Vente,160000,18,A,LA DREDIE NORD,B020,24510,24327,Pezuls,24,,,243270000A0435,,,,,,,,,,,,,0,1,Maison,81,3,L,landes,,,1050,0.802739,44.909128
2023-266928,2023-05-12,000001,Vente,160000,18,A,LA DREDIE NORD,B020,24510,24327,Pezuls,24,,,243270000A0435,,,,,,,,,,,,,0,1,Maison,81,3,S,sols,,,800,0.802739,44.909128
2023-266928,2023-05-12,000001,Vente,160000,,,LA DREDIE NORD,B020,24510,24327,Pezuls,24,,,243270000A0436,,,,,,,,,,,,,0,,,,,T,terres,,,7210,0.802078,44.909404
2023-266928,2023-05-12,000001,Vente,160000,,,LA DREDIE NORD,B020,24510,24327,Pezuls,24,,,243270000A0644,,,,,,,,,,,,,0,,,,,L,landes,,,5430,0.801945,44.910153
2023-266928,2023-05-12,000001,Vente,160000,,,LA DREDIE NORD,B020,24510,24327,Pezuls,24,,,243270000A0645,,,,,,,,,,,,,0,,,,,L,landes,,,2000,0.802716,44.909746
2023-266928,2023-05-12,000001,Vente,160000,,,LA DREDIE NORD,B020,24510,24327,Pezuls,24,,,243270000A0646,,,,,,,,,,,,,0,,,,,T,terres,,,5345,0.803222,44.910426
2023-266928,2023-05-12,000001,Vente,160000,,,LA DREDIE NORD,B020,24510,24327,Pezuls,24,,,243270000A0647,,,,,,,,,,,,,0,,,,,T,terres,,,7918,0.803681,44.909639
2023-267169,2023-06-09,000001,Vente,4000,,,LA FONT TREMOLASSE,B024,24510,24327,Pezuls,24,,,243270000A0302,,,,,,,,,,,,,0,,,,,T,terres,,,4025,0.787009,44.912816
2023-267169,2023-06-09,000001,Vente,4000,,,LA FONT TREMOLASSE,B024,24510,24327,Pezuls,24,,,243270000A0309,,,,,,,,,,,,,0,,,,,L,landes,,,1235,0.789543,44.913924
2023-267169,2023-06-09,000001,Vente,4000,,,LA FONT TREMOLASSE,B024,24510,24327,Pezuls,24,,,243270000A0571,,,,,,,,,,,,,0,,,,,BT,taillis simples,,,21320,0.787818,44.912439
2023-269469,2023-08-08,000001,Vente,270,,,LE BOUSSINET,B010,24510,24327,Pezuls,24,,,243270000A0776,,,,,,,,,,,,,0,,,,,BT,taillis simples,,,270,0.782278,44.907365
2023-270060,2023-08-24,000001,Vente,209010,25,,LE BOURG EST,B008,24510,24327,Pezuls,24,,,243270000A0604,,,,,,,,,,,,,0,3,Dépendance,,0,S,sols,,,1285,0.80564,44.912915
2023-270060,2023-08-24,000001,Vente,209010,25,,LE BOURG EST,B008,24510,24327,Pezuls,24,,,243270000A0604,,,,,,,,,,,,,0,1,Maison,157,5,S,sols,,,1285,0.80564,44.912915
2023-270060,2023-08-24,000001,Vente,209010,25,,LE BOURG EST,B008,24510,24327,Pezuls,24,,,243270000A0604,,,,,,,,,,,,,0,3,Dépendance,,0,S,sols,,,1285,0.80564,44.912915
2023-270459,2023-08-28,000001,Vente,2500,,,LES RUSSIES,B046,24510,24327,Pezuls,24,,,243270000A0257,,,,,,,,,,,,,0,,,,,L,landes,,,1400,0.78237,44.915638
2023-270459,2023-08-28,000001,Vente,2500,,,LES RUSSIES,B046,24510,24327,Pezuls,24,,,243270000A0286,,,,,,,,,,,,,0,,,,,BT,taillis simples,,,4060,0.784584,44.914994
2023-270459,2023-08-28,000001,Vente,2500,,,LES RUSSIES,B046,24510,24327,Pezuls,24,,,243270000A0672,,,,,,,,,,,,,0,,,,,BT,taillis simples,,,5885,0.785382,44.915601
2023-271032,2023-09-11,000001,Vente,139500,,,LES BARRIERES,B004,24510,24327,Pezuls,24,,,243270000A0425,,,,,,,,,,,,,0,,,,,S,sols,,,145,0.807494,44.904687
2023-271032,2023-09-11,000001,Vente,139500,,,LES BARRIERES,B004,24510,24327,Pezuls,24,,,243270000A0426,,,,,,,,,,,,,0,,,,,T,terres,,,11610,0.805677,44.905142
2023-271032,2023-09-11,000001,Vente,139500,,,LES BARRIERES,B004,24510,24327,Pezuls,24,,,243270000A0709,,,,,,,,,,,,,0,,,,,T,terres,,,9327,0.807272,44.905044
2023-271032,2023-09-11,000001,Vente,139500,,,LA BORIE NEUVE,B006,24510,24327,Pezuls,24,,,243270000D0120,,,,,,,,,,,,,0,,,,,T,terres,,,2500,0.806236,44.904296
2023-271032,2023-09-11,000001,Vente,139500,,,LA BORIE NEUVE,B006,24510,24327,Pezuls,24,,,243270000D0328,,,,,,,,,,,,,0,,,,,L,landes,,,5622,0.806805,44.904545
2023-272212,2023-10-25,000001,Vente,132000,63,,CAPPARIE OUEST,B013,24510,24327,Pezuls,24,,,243270000C0259,,,,,,,,,,,,,0,1,Maison,120,4,S,sols,,,1260,0.816122,44.903224
2023-272212,2023-10-25,000001,Vente,132000,,,CAPPARIE OUEST,B013,24510,24327,Pezuls,24,,,243270000C0260,,,,,,,,,,,,,0,,,,,BT,taillis simples,,,6070,0.81548,44.90319
2023-272212,2023-10-25,000001,Vente,132000,,,CAPPARIE OUEST,B013,24510,24327,Pezuls,24,,,243270000C0261,,,,,,,,,,,,,0,,,,,P,prés,,,1185,0.814887,44.902966
2023-272212,2023-10-25,000001,Vente,132000,,,CAPPARIE OUEST,B013,24510,24327,Pezuls,24,,,243270000C0262,,,,,,,,,,,,,0,,,,,P,prés,,,900,0.815168,44.902789
