id_mutation,date_mutation,numero_disposition,nature_mutation,valeur_fonciere,adresse_numero,adresse_suffixe,adresse_nom_voie,adresse_code_voie,code_postal,code_commune,nom_commune,code_departement,ancien_code_commune,ancien_nom_commune,id_parcelle,ancien_id_parcelle,numero_volume,lot1_numero,lot1_surface_carrez,lot2_numero,lot2_surface_carrez,lot3_numero,lot3_surface_carrez,lot4_numero,lot4_surface_carrez,lot5_numero,lot5_surface_carrez,nombre_lots,code_type_local,type_local,surface_reelle_bati,nombre_pieces_principales,code_nature_culture,nature_culture,code_nature_culture_speciale,nature_culture_speciale,surface_terrain,longitude,latitude
2023-264142,2023-03-08,000001,Vente,5000,,,LE MOULIN A VENT,B046,24540,24378,Saint-Avit-Rivière,24,,,243780000C0124,,,,,,,,,,,,,0,,,,,BS,taillis sous futaie,,,9500,0.946744,44.735462
2023-264142,2023-03-08,000001,Vente,5000,,,LE MOULIN A VENT,B046,24540,24378,Saint-Avit-Rivière,24,,,243780000C0128,,,,,,,,,,,,,0,,,,,BS,taillis sous futaie,,,13250,0.944851,44.734617
2023-264142,2023-03-08,000001,Vente,5000,,,LEONNE HAUTE,B041,24540,24378,Saint-Avit-Rivière,24,,,243780000C0189,,,,,,,,,,,,,0,,,,,BT,taillis simples,,,1630,0.929065,44.732888
2023-264142,2023-03-08,000001,Vente,5000,,,LE CAMINEL,B010,24540,24378,Saint-Avit-Rivière,24,,,243780000C0314,,,,,,,,,,,,,0,,,,,BT,taillis simples,,,5280,0.92404,44.741178
2023-264142,2023-03-08,000001,Vente,5000,,,LES RAZES,B057,24540,24378,Saint-Avit-Rivière,24,,,243780000C0390,,,,,,,,,,,,,0,,,,,BT,taillis simples,,,1830,0.927243,44.73551
2023-264142,2023-03-08,000001,Vente,5000,,,LE MOULIN A VENT,B046,24540,24378,Saint-Avit-Rivière,24,,,243780000C0739,,,,,,,,,,,,,0,,,,,BS,taillis sous futaie,,,5145,0.94066,44.732132
2023-264142,2023-03-08,000001,Vente,5000,,,LE MOULIN A VENT,B046,24540,24378,Saint-Avit-Rivière,24,,,243780000C0740,,,,,,,,,,,,,0,,,,,BS,taillis sous futaie,,,105,0.940187,44.732394
2023-271530,2023-10-19,000001,Vente,186840,41,A,ASTOR,B002,24540,24378,Saint-Avit-Rivière,24,,,243780000B0107,,,,,,,,,,,,,0,1,Maison,108,4,S,sols,,,331,0.906616,44.758224
2023-271530,2023-10-19,000001,Vente,186840,,,ASTOR,B002,24540,24378,Saint-Avit-Rivière,24,,,243780000B0108,,,,,,,,,,,,,0,,,,,P,prés,,,1540,0.906544,44.75845
2023-271530,2023-10-19,000001,Vente,186840,,,ASTOR,B002,24540,24378,Saint-Avit-Rivière,24,,,243780000B0108,,,,,,,,,,,,,0,,,,,S,sols,,,300,0.906544,44.75845
2023-271530,2023-10-19,000001,Vente,186840,,,ASTOR,B002,24540,24378,Saint-Avit-Rivière,24,,,243780000B0574,,,,,,,,,,,,,0,,,,,BS,taillis sous futaie,,,2607,0.906187,44.758577
