id_mutation,date_mutation,numero_disposition,nature_mutation,valeur_fonciere,adresse_numero,adresse_suffixe,adresse_nom_voie,adresse_code_voie,code_postal,code_commune,nom_commune,code_departement,ancien_code_commune,ancien_nom_commune,id_parcelle,ancien_id_parcelle,numero_volume,lot1_numero,lot1_surface_carrez,lot2_numero,lot2_surface_carrez,lot3_numero,lot3_surface_carrez,lot4_numero,lot4_surface_carrez,lot5_numero,lot5_surface_carrez,nombre_lots,code_type_local,type_local,surface_reelle_bati,nombre_pieces_principales,code_nature_culture,nature_culture,code_nature_culture_speciale,nature_culture_speciale,surface_terrain,longitude,latitude
2023-263544,2023-03-03,000001,Vente,235849,,,PLACETTES,B047,24510,24407,Sainte-Foy-de-Longas,24,,,244070000C0069,,,,,,,,,,,,,0,,,,,BT,taillis simples,,,630,0.749646,44.918863
2023-263544,2023-03-03,000001,Vente,235849,42,,PLACETTES,B047,24510,24407,Sainte-Foy-de-Longas,24,,,244070000C0071,,,,,,,,,,,,,0,3,Dépendance,,0,S,sols,,,950,0.749899,44.92008
2023-263544,2023-03-03,000001,Vente,235849,42,,PLACETTES,B047,24510,24407,Sainte-Foy-de-Longas,24,,,244070000C0071,,,,,,,,,,,,,0,3,Dépendance,,0,S,sols,,,950,0.749899,44.92008
2023-263544,2023-03-03,000001,Vente,235849,42,,PLACETTES,B047,24510,24407,Sainte-Foy-de-Longas,24,,,244070000C0071,,,,,,,,,,,,,0,1,Maison,135,5,S,sols,,,950,0.749899,44.92008
2023-263544,2023-03-03,000001,Vente,235849,,,PLACETTES,B047,24510,24407,Sainte-Foy-de-Longas,24,,,244070000C0526,,,,,,,,,,,,,0,,,,,BT,taillis simples,,,3928,0.749302,44.919426
2023-263544,2023-03-03,000001,Vente,235849,42,A,PLACETTES,B047,24510,24407,Sainte-Foy-de-Longas,24,,,244070000C0527,,,,,,,,,,,,,0,3,Dépendance,,0,T,terres,,,17475,0.749881,44.919861
2023-263544,2023-03-03,000001,Vente,235849,42,A,PLACETTES,B047,24510,24407,Sainte-Foy-de-Longas,24,,,244070000C0527,,,,,,,,,,,,,0,3,Dépendance,,0,S,sols,,,400,0.749881,44.919861
2023-263544,2023-03-03,000001,Vente,235849,,,PLACETTES,B047,24510,24407,Sainte-Foy-de-Longas,24,,,244070000C0530,,,,,,,,,,,,,0,,,,,T,terres,,,3034,0.749594,44.918687
2023-263544,2023-03-03,000001,Vente,235849,,,PLACETTES,B047,24510,24407,Sainte-Foy-de-Longas,24,,,244070000C0531,,,,,,,,,,,,,0,,,,,BT,taillis simples,,,820,0.750322,44.918452
2023-263612,2023-03-03,000001,Vente,59000,,,BRESSAC,B012,24510,24407,Sainte-Foy-de-Longas,24,,,244070000B0053,,,,,,,,,,,,,0,,,,,T,terres,,,5470,,
2023-263612,2023-03-03,000001,Vente,59000,,,COMBE DE LOL,B019,24510,24407,Sainte-Foy-de-Longas,24,,,244070000B0182,,,,,,,,,,,,,0,,,,,T,terres,,,6540,0.738132,44.938914
2023-263612,2023-03-03,000001,Vente,59000,,,COMBE DE LOL,B019,24510,24407,Sainte-Foy-de-Longas,24,,,244070000B0183,,,,,,,,,,,,,0,,,,,T,terres,,,22860,0.740542,44.939246
2023-263612,2023-03-03,000001,Vente,59000,,,LA BERENIE,B005,24510,24407,Sainte-Foy-de-Longas,24,,,244070000B0279,,,,,,,,,,,,,0,,,,,VI,vignes,,,6860,0.734444,44.9378
2023-263612,2023-03-03,000001,Vente,59000,,,LA BERENIE,B005,24510,24407,Sainte-Foy-de-Longas,24,,,244070000B0280,,,,,,,,,,,,,0,,,,,T,terres,,,8240,0.73547,44.938203
2023-263612,2023-03-03,000001,Vente,59000,,,MOULIN POMMIER,B041,24510,24407,Sainte-Foy-de-Longas,24,,,244070000B0451,,,,,,,,,,,,,0,,,,,P,prés,,,1010,0.729331,44.923961
2023-263612,2023-03-03,000001,Vente,59000,,,MOULIN POMMIER,B041,24510,24407,Sainte-Foy-de-Longas,24,,,244070000B0453,,,,,,,,,,,,,0,,,,,P,prés,,,6950,0.728586,44.923544
2023-263612,2023-03-03,000001,Vente,59000,,,LA BERENIE,B005,24510,24407,Sainte-Foy-de-Longas,24,,,244070000B0539,,,,,,,,,,,,,0,,,,,T,terres,,,126,0.732841,44.940143
2023-263612,2023-03-03,000001,Vente,59000,,,LA BERENIE,B005,24510,24407,Sainte-Foy-de-Longas,24,,,244070000B0735,,,,,,,,,,,,,0,,,,,T,terres,,,10460,0.733806,44.93969
2023-263612,2023-03-03,000001,Vente,59000,,,LA BERENIE,B005,24510,24407,Sainte-Foy-de-Longas,24,,,244070000B0737,,,,,,,,,,,,,0,,,,,T,terres,,,4893,0.734163,44.938722
2023-263612,2023-03-03,000001,Vente,59000,,,LA BERENIE,B005,24510,24407,Sainte-Foy-de-Longas,24,,,244070000B0737,,,,,,,,,,,,,0,,,,,T,terres,,,4893,0.734163,44.938722
2023-265177,2023-04-03,000001,Vente,30000,,,LESPARRE,B033,24510,24407,Sainte-Foy-de-Longas,24,,,244070000D0396,,,,,,,,,,,,,0,,,,,BT,taillis simples,,,3445,0.777506,44.918786
2023-267709,2023-06-09,000001,Vente,2000,,,LONGAS,B035,24510,24407,Sainte-Foy-de-Longas,24,,,244070000A0688,,,,,,,,,,,,,0,,,,,L,landes,,,26545,0.761105,44.932932
2023-267709,2023-06-09,000001,Vente,2000,,,LONGAS,B035,24510,24407,Sainte-Foy-de-Longas,24,,,244070000A0688,,,,,,,,,,,,,0,,,,,T,terres,,,1597,0.761105,44.932932
2023-267709,2023-06-09,000001,Vente,2000,,,LES FAURES,B024,24510,24407,Sainte-Foy-de-Longas,24,,,244070000A0761,,,,,,,,,,,,,0,,,,,T,terres,,,26165,0.768804,44.936017
2023-268730,2023-07-25,000002,Vente,2500,,,LESPARRE,B033,24510,24407,Sainte-Foy-de-Longas,24,,,244070000D0612,,,,,,,,,,,,,0,,,,,BT,taillis simples,,,653,0.778368,44.918649
2023-269168,2023-07-26,000001,Vente,76000,,,BOS DE LA LISSOU,B009,24510,24407,Sainte-Foy-de-Longas,24,,,244070000D0270,,,,,,,,,,,,,0,,,,,BT,taillis simples,,,2860,0.782846,44.917385
2023-269168,2023-07-26,000001,Vente,76000,,,BOS DE LA LISSOU,B009,24510,24407,Sainte-Foy-de-Longas,24,,,244070000D0281,,,,,,,,,,,,,0,,,,,BT,taillis simples,,,6040,0.784445,44.917458
2023-269168,2023-07-26,000001,Vente,76000,,,BOS DE LA LISSOU,B009,24510,24407,Sainte-Foy-de-Longas,24,,,244070000D0284,,,,,,,,,,,,,0,,,,,P,prés,,,2380,0.783656,44.91848
2023-269168,2023-07-26,000001,Vente,76000,103,,BOS DE LA LISSOU,B009,24510,24407,Sainte-Foy-de-Longas,24,,,244070000D0285,,,,,,,,,,,,,0,3,Dépendance,,0,S,sols,,,730,0.7832,44.918069
2023-269168,2023-07-26,000001,Vente,76000,103,,BOS DE LA LISSOU,B009,24510,24407,Sainte-Foy-de-Longas,24,,,244070000D0285,,,,,,,,,,,,,0,3,Dépendance,,0,S,sols,,,730,0.7832,44.918069
2023-269168,2023-07-26,000001,Vente,76000,103,,BOS DE LA LISSOU,B009,24510,24407,Sainte-Foy-de-Longas,24,,,244070000D0285,,,,,,,,,,,,,0,1,Maison,110,5,S,sols,,,730,0.7832,44.918069
2023-269168,2023-07-26,000001,Vente,76000,,,BOS DE LA LISSOU,B009,24510,24407,Sainte-Foy-de-Longas,24,,,244070000D0374,,,,,,,,,,,,,0,,,,,BT,taillis simples,,,5685,0.783491,44.917641
2023-269168,2023-07-26,000001,Vente,76000,,,BOS DE LA LISSOU,B009,24510,24407,Sainte-Foy-de-Longas,24,,,244070000D0375,,,,,,,,,,,,,0,,,,,BT,taillis simples,,,890,0.782036,44.918319
2023-269168,2023-07-26,000001,Vente,76000,,,BOS DE LA LISSOU,B009,24510,24407,Sainte-Foy-de-Longas,24,,,244070000D0430,,,,,,,,,,,,,0,,,,,T,terres,,,4973,0.782978,44.918812
2023-269168,2023-07-26,000001,Vente,76000,,,BOS DE LA LISSOU,B009,24510,24407,Sainte-Foy-de-Longas,24,,,244070000D0431,,,,,,,,,,,,,0,,,,,S,sols,,,20,0.783067,44.918189
2023-269168,2023-07-26,000001,Vente,76000,,,BOS DE LA LISSOU,B009,24510,24407,Sainte-Foy-de-Longas,24,,,244070000D0433,,,,,,,,,,,,,0,,,,,T,terres,,,11000,0.783777,44.917992
2023-269168,2023-07-26,000001,Vente,76000,,,BOS DE LA LISSOU,B009,24510,24407,Sainte-Foy-de-Longas,24,,,244070000D0433,,,,,,,,,,,,,0,,,,,S,sols,,,800,0.783777,44.917992
2023-269168,2023-07-26,000001,Vente,76000,,,BOS DE LA LISSOU,B009,24510,24407,Sainte-Foy-de-Longas,24,,,244070000D0433,,,,,,,,,,,,,0,,,,,AG,terrains d'agrément,,,1473,0.783777,44.917992
2023-269168,2023-07-26,000001,Vente,76000,,,BOS DE LA LISSOU,B009,24510,24407,Sainte-Foy-de-Longas,24,,,244070000D0433,,,,,,,,,,,,,0,,,,,T,terres,,,11000,0.783777,44.917992
2023-269168,2023-07-26,000001,Vente,76000,,,BOS DE LA LISSOU,B009,24510,24407,Sainte-Foy-de-Longas,24,,,244070000D0444,,,,,,,,,,,,,0,,,,,BT,taillis simples,,,18468,0.783276,44.917197
2023-269194,2023-07-10,000001,Vente,50,,,LES VERSANNES,B056,24510,24407,Sainte-Foy-de-Longas,24,,,244070000A0481,,,,,,,,,,,,,0,,,,,S,sols,,,113,0.754086,44.92606
2023-269772,2023-08-24,000002,Vente,50,,,BRESSAC,B012,24510,24407,Sainte-Foy-de-Longas,24,,,244070000B0837,,,,,,,,,,,,,0,,,,,T,terres,,,189,0.742272,44.939542
2023-269885,2023-08-25,000001,Vente,162617,21,,LE PECH,B043,24510,24407,Sainte-Foy-de-Longas,24,,,244070000A0728,,,,,,,,,,,,,0,1,Maison,129,5,S,sols,,,800,0.755863,44.927464
2023-269885,2023-08-25,000001,Vente,162617,21,,LE PECH,B043,24510,24407,Sainte-Foy-de-Longas,24,,,244070000A0728,,,,,,,,,,,,,0,3,Dépendance,,0,S,sols,,,800,0.755863,44.927464
2023-269885,2023-08-25,000001,Vente,162617,21,,LE PECH,B043,24510,24407,Sainte-Foy-de-Longas,24,,,244070000A0728,,,,,,,,,,,,,0,3,Dépendance,,0,S,sols,,,800,0.755863,44.927464
2023-269885,2023-08-25,000001,Vente,162617,21,,LE PECH,B043,24510,24407,Sainte-Foy-de-Longas,24,,,244070000A0728,,,,,,,,,,,,,0,3,Dépendance,,0,AG,terrains d'agrément,,,951,0.755863,44.927464
2023-269885,2023-08-25,000001,Vente,162617,21,,LE PECH,B043,24510,24407,Sainte-Foy-de-Longas,24,,,244070000A0728,,,,,,,,,,,,,0,3,Dépendance,,0,AG,terrains d'agrément,,,951,0.755863,44.927464
2023-269885,2023-08-25,000001,Vente,162617,21,,LE PECH,B043,24510,24407,Sainte-Foy-de-Longas,24,,,244070000A0728,,,,,,,,,,,,,0,1,Maison,129,5,AG,terrains d'agrément,,,951,0.755863,44.927464
2023-270120,2023-09-05,000001,Vente,200,,,CAMBEROUX,B017,24510,24407,Sainte-Foy-de-Longas,24,,,244070000C0388,,,,,,,,,,,,,0,,,,,P,prés,,,590,0.736346,44.921037
2023-270459,2023-08-28,000001,Vente,2500,,,LE DEFFE,B021,24510,24407,Sainte-Foy-de-Longas,24,,,244070000D0187,,,,,,,,,,,,,0,,,,,L,landes,,,610,0.782528,44.923828
2023-270459,2023-08-28,000001,Vente,2500,,,BOS DE LA LISSOU,B009,24510,24407,Sainte-Foy-de-Longas,24,,,244070000D0276,,,,,,,,,,,,,0,,,,,BT,taillis simples,,,1090,0.786032,44.91624
2023-270459,2023-08-28,000001,Vente,2500,,,BOS DE LA LISSOU,B009,24510,24407,Sainte-Foy-de-Longas,24,,,244070000D0497,,,,,,,,,,,,,0,,,,,P,prés,,,520,0.785996,44.916055
2023-270465,2023-08-28,000001,Vente,110000,,,L ORTUSSOL,B042,24510,24407,Sainte-Foy-de-Longas,24,,,244070000D0422,,,,,,,,,,,,,0,,,,,L,landes,,,37,0.779117,44.918448
2023-270465,2023-08-28,000001,Vente,110000,,,L ORTUSSOL,B042,24510,24407,Sainte-Foy-de-Longas,24,,,244070000D0426,,,,,,,,,,,,,0,,,,,L,landes,,,157,0.777817,44.918334
2023-270465,2023-08-28,000001,Vente,110000,102,,L ORTUSSOL,B042,24510,24407,Sainte-Foy-de-Longas,24,,,244070000D0494,,,,,,,,,,,,,0,1,Maison,96,3,BT,taillis simples,,,2081,0.778489,44.918312
2023-270465,2023-08-28,000001,Vente,110000,102,,L ORTUSSOL,B042,24510,24407,Sainte-Foy-de-Longas,24,,,244070000D0494,,,,,,,,,,,,,0,1,Maison,96,3,T,terres,,,2980,0.778489,44.918312
2023-270465,2023-08-28,000001,Vente,110000,102,,L ORTUSSOL,B042,24510,24407,Sainte-Foy-de-Longas,24,,,244070000D0494,,,,,,,,,,,,,0,1,Maison,96,3,S,sols,,,470,0.778489,44.918312
2023-270674,2023-08-30,000001,Vente,5000,,,LES FAURES,B024,24510,24407,Sainte-Foy-de-Longas,24,,,244070000A0761,,,,,,,,,,,,,0,,,,,T,terres,,,26165,0.768804,44.936017
2023-270675,2023-08-29,000001,Vente,100,,,LES FAURES,B024,24510,24407,Sainte-Foy-de-Longas,24,,,244070000A0507,,,,,,,,,,,,,0,,,,,T,terres,,,44,0.771247,44.934839
2023-271122,2023-10-05,000001,Vente,25540,56,,LE BOURG,B011,24510,24407,Sainte-Foy-de-Longas,24,,,244070000C0128,,,,,,,,,,,,,0,1,Maison,58,3,S,sols,,,300,0.750776,44.925402
2023-271122,2023-10-05,000001,Vente,25540,,,LE BOURG,B011,24510,24407,Sainte-Foy-de-Longas,24,,,244070000C0129,,,,,,,,,,,,,0,,,,,J,jardins,,,40,0.750829,44.925293
2023-271203,2023-10-05,000001,Vente,1000,,,MOULIN DE LA ROQUE,B039,24510,24407,Sainte-Foy-de-Longas,24,,,244070000B0104,,,,,,,,,,,,,0,,,,,P,prés,,,1820,0.746945,44.92528
2023-271203,2023-10-05,000001,Vente,1000,,,MOULIN DE LA ROQUE,B039,24510,24407,Sainte-Foy-de-Longas,24,,,244070000B0104,,,,,,,,,,,,,0,,,,,P,prés,,,1820,0.746945,44.92528
2023-271204,2023-10-05,000001,Vente,1280,,,LE BOURG,B011,24510,24407,Sainte-Foy-de-Longas,24,,,244070000C0107,,,,,,,,,,,,,0,,,,,T,terres,,,2120,0.747351,44.925089
2023-271204,2023-10-05,000001,Vente,1280,,,LE BOURG,B011,24510,24407,Sainte-Foy-de-Longas,24,,,244070000C0107,,,,,,,,,,,,,0,,,,,T,terres,,,2120,0.747351,44.925089
2023-271314,2023-09-19,000001,Vente,3000,,,LA CADENELIE,B016,24510,24407,Sainte-Foy-de-Longas,24,,,244070000E0149,,,,,,,,,,,,,0,,,,,BT,taillis simples,,,1610,0.774572,44.926137
2023-271509,2023-09-28,000001,Vente,235000,108,A,LES BERTRANDES,B006,24510,24407,Sainte-Foy-de-Longas,24,,,244070000E0451,,,,,,,,,,,,,0,1,Maison,110,4,T,terres,,,3803,0.766799,44.917487
2023-271509,2023-09-28,000001,Vente,235000,108,A,LES BERTRANDES,B006,24510,24407,Sainte-Foy-de-Longas,24,,,244070000E0451,,,,,,,,,,,,,0,3,Dépendance,,0,T,terres,,,3803,0.766799,44.917487
2023-271509,2023-09-28,000001,Vente,235000,108,A,LES BERTRANDES,B006,24510,24407,Sainte-Foy-de-Longas,24,,,244070000E0451,,,,,,,,,,,,,0,3,Dépendance,,0,T,terres,,,3803,0.766799,44.917487
2023-271509,2023-09-28,000001,Vente,235000,108,A,LES BERTRANDES,B006,24510,24407,Sainte-Foy-de-Longas,24,,,244070000E0451,,,,,,,,,,,,,0,3,Dépendance,,0,T,terres,,,3803,0.766799,44.917487
2023-271509,2023-09-28,000001,Vente,235000,108,A,LES BERTRANDES,B006,24510,24407,Sainte-Foy-de-Longas,24,,,244070000E0451,,,,,,,,,,,,,0,1,Maison,88,3,T,terres,,,3803,0.766799,44.917487
2023-271509,2023-09-28,000001,Vente,235000,108,A,LES BERTRANDES,B006,24510,24407,Sainte-Foy-de-Longas,24,,,244070000E0451,,,,,,,,,,,,,0,3,Dépendance,,0,T,terres,,,3803,0.766799,44.917487
2023-271509,2023-09-28,000001,Vente,235000,108,A,LES BERTRANDES,B006,24510,24407,Sainte-Foy-de-Longas,24,,,244070000E0451,,,,,,,,,,,,,0,3,Dépendance,,0,S,sols,,,2000,0.766799,44.917487
2023-271509,2023-09-28,000001,Vente,235000,108,A,LES BERTRANDES,B006,24510,24407,Sainte-Foy-de-Longas,24,,,244070000E0451,,,,,,,,,,,,,0,3,Dépendance,,0,S,sols,,,2000,0.766799,44.917487
2023-271509,2023-09-28,000001,Vente,235000,108,A,LES BERTRANDES,B006,24510,24407,Sainte-Foy-de-Longas,24,,,244070000E0451,,,,,,,,,,,,,0,3,Dépendance,,0,S,sols,,,2000,0.766799,44.917487
2023-271509,2023-09-28,000001,Vente,235000,108,A,LES BERTRANDES,B006,24510,24407,Sainte-Foy-de-Longas,24,,,244070000E0451,,,,,,,,,,,,,0,1,Maison,88,3,S,sols,,,2000,0.766799,44.917487
2023-271509,2023-09-28,000001,Vente,235000,108,A,LES BERTRANDES,B006,24510,24407,Sainte-Foy-de-Longas,24,,,244070000E0451,,,,,,,,,,,,,0,1,Maison,110,4,S,sols,,,2000,0.766799,44.917487
2023-271509,2023-09-28,000001,Vente,235000,108,A,LES BERTRANDES,B006,24510,24407,Sainte-Foy-de-Longas,24,,,244070000E0451,,,,,,,,,,,,,0,3,Dépendance,,0,S,sols,,,2000,0.766799,44.917487
2023-271533,2023-09-22,000001,Vente,500,,,FONTAINE DE BRESSAC,B025,24510,24407,Sainte-Foy-de-Longas,24,,,244070000B0611,,,,,,,,,,,,,0,,,,,BT,taillis simples,,,1181,0.744381,44.933934
2023-271533,2023-09-22,000001,Vente,500,,,FONTAINE DE BRESSAC,B025,24510,24407,Sainte-Foy-de-Longas,24,,,244070000B0614,,,,,,,,,,,,,0,,,,,BT,taillis simples,,,811,0.743955,44.933908
2023-271533,2023-09-22,000001,Vente,500,,,LE PIGEONNIER,B046,24510,24407,Sainte-Foy-de-Longas,24,,,244070000B0748,,,,,,,,,,,,,0,,,,,L,landes,,,310,0.743079,44.933724
2023-271533,2023-09-22,000001,Vente,500,,,LE PIGEONNIER,B046,24510,24407,Sainte-Foy-de-Longas,24,,,244070000B0750,,,,,,,,,,,,,0,,,,,L,landes,,,38,0.743421,44.933826
2023-271533,2023-09-22,000001,Vente,500,,,LES GREZES,B030,24510,24407,Sainte-Foy-de-Longas,24,,,244070000B0752,,,,,,,,,,,,,0,,,,,BT,taillis simples,,,115,0.743587,44.933872
2023-272606,2023-10-30,000001,Vente,1300,,,LE CAYROU,B018,24510,24407,Sainte-Foy-de-Longas,24,,,244070000D0164,,,,,,,,,,,,,0,,,,,BT,taillis simples,,,7840,0.782726,44.925665
2023-272716,2023-09-01,000001,Vente,34040,,,MOULIN POMMIER,B041,24510,24407,Sainte-Foy-de-Longas,24,,,244070000B0411,,,,,,,,,,,,,0,,,,,BT,taillis simples,,,3380,0.731158,44.926695
2023-272716,2023-09-01,000001,Vente,34040,,,MOULIN POMMIER,B041,24510,24407,Sainte-Foy-de-Longas,24,,,244070000B0412,,,,,,,,,,,,,0,,,,,BT,taillis simples,,,15440,0.73183,44.926385
2023-272716,2023-09-01,000001,Vente,34040,,,SUDRIE,B053,24510,24407,Sainte-Foy-de-Longas,24,,,244070000B0456,,,,,,,,,,,,,0,,,,,BR,futaies résineuses,,,2550,0.727952,44.925088
2023-272716,2023-09-01,000001,Vente,34040,,,SUDRIE,B053,24510,24407,Sainte-Foy-de-Longas,24,,,244070000B0457,,,,,,,,,,,,,0,,,,,BR,futaies résineuses,,,1950,0.728023,44.925418
2023-272716,2023-09-01,000001,Vente,34040,,,SUDRIE,B053,24510,24407,Sainte-Foy-de-Longas,24,,,244070000B0458,,,,,,,,,,,,,0,,,,,L,landes,,,4940,0.728128,44.925773
2023-272716,2023-09-01,000001,Vente,34040,,,SUDRIE,B053,24510,24407,Sainte-Foy-de-Longas,24,,,244070000B0459,,,,,,,,,,,,,0,,,,,BR,futaies résineuses,,,20040,0.728593,44.926268
2023-272716,2023-09-01,000001,Vente,34040,,,SUDRIE,B053,24510,24407,Sainte-Foy-de-Longas,24,,,244070000B0460,,,,,,,,,,,,,0,,,,,BR,futaies résineuses,,,3390,0.729729,44.926714
2023-272716,2023-09-01,000001,Vente,34040,,,SUDRIE,B053,24510,24407,Sainte-Foy-de-Longas,24,,,244070000B0461,,,,,,,,,,,,,0,,,,,BR,futaies résineuses,,,2050,0.729983,44.926945
2023-272716,2023-09-01,000001,Vente,34040,,,SUDRIE,B053,24510,24407,Sainte-Foy-de-Longas,24,,,244070000B0463,,,,,,,,,,,,,0,,,,,BT,taillis simples,,,8660,0.73045,44.927071
2023-272716,2023-09-01,000001,Vente,34040,,,SUDRIE,B053,24510,24407,Sainte-Foy-de-Longas,24,,,244070000B0464,,,,,,,,,,,,,0,,,,,BT,taillis simples,,,6390,0.731754,44.927352
2023-272716,2023-09-01,000001,Vente,34040,,,SUDRIE,B053,24510,24407,Sainte-Foy-de-Longas,24,,,244070000B0496,,,,,,,,,,,,,0,,,,,BR,futaies résineuses,,,8200,0.726702,44.930659
2023-272716,2023-09-01,000001,Vente,34040,,,SUDRIE,B053,24510,24407,Sainte-Foy-de-Longas,24,,,244070000B0499,,,,,,,,,,,,,0,,,,,B,bois,,,2940,0.727459,44.931831
2023-272716,2023-09-01,000001,Vente,34040,,,SUDRIE,B053,24510,24407,Sainte-Foy-de-Longas,24,,,244070000B0499,,,,,,,,,,,,,0,,,,,BR,futaies résineuses,,,1260,0.727459,44.931831
2023-272716,2023-09-01,000001,Vente,34040,,,SUDRIE,B053,24510,24407,Sainte-Foy-de-Longas,24,,,244070000B0500,,,,,,,,,,,,,0,,,,,BR,futaies résineuses,,,5418,0.726667,44.931839
2023-272716,2023-09-01,000001,Vente,34040,,,SUDRIE,B053,24510,24407,Sainte-Foy-de-Longas,24,,,244070000B0500,,,,,,,,,,,,,0,,,,,B,bois,,,12642,0.726667,44.931839
2023-272716,2023-09-01,000001,Vente,34040,,,SUDRIE,B053,24510,24407,Sainte-Foy-de-Longas,24,,,244070000B0570,,,,,,,,,,,,,0,,,,,L,landes,,,81,0.731183,44.93045
