id_mutation,date_mutation,numero_disposition,nature_mutation,valeur_fonciere,adresse_numero,adresse_suffixe,adresse_nom_voie,adresse_code_voie,code_postal,code_commune,nom_commune,code_departement,ancien_code_commune,ancien_nom_commune,id_parcelle,ancien_id_parcelle,numero_volume,lot1_numero,lot1_surface_carrez,lot2_numero,lot2_surface_carrez,lot3_numero,lot3_surface_carrez,lot4_numero,lot4_surface_carrez,lot5_numero,lot5_surface_carrez,nombre_lots,code_type_local,type_local,surface_reelle_bati,nombre_pieces_principales,code_nature_culture,nature_culture,code_nature_culture_speciale,nature_culture_speciale,surface_terrain,longitude,latitude
2023-285756,2023-01-13,000001,Vente,100000,30,,RTE DE LA PLAINE,0330,26210,26162,Lens-Lestang,26,,,26162000AO0225,,,,,,,,,,,,,0,3,Dépendance,,0,S,sols,,,258,5.042824,45.291844
2023-285756,2023-01-13,000001,Vente,100000,30,,RTE DE LA PLAINE,0330,26210,26162,Lens-Lestang,26,,,26162000AO0225,,,,,,,,,,,,,0,3,Dépendance,,0,S,sols,,,258,5.042824,45.291844
2023-285756,2023-01-13,000001,Vente,100000,30,,RTE DE LA PLAINE,0330,26210,26162,Lens-Lestang,26,,,26162000AO0225,,,,,,,,,,,,,0,2,Appartement,100,5,S,sols,,,258,5.042824,45.291844
2023-285756,2023-01-13,000001,Vente,100000,30,,RTE DE LA PLAINE,0330,26210,26162,Lens-Lestang,26,,,26162000AO0225,,,,,,,,,,,,,0,4,Local industriel. commercial ou assimilé,120,0,S,sols,,,258,5.042824,45.291844
2023-285756,2023-01-13,000001,Vente,100000,30,,RTE DE LA PLAINE,0330,26210,26162,Lens-Lestang,26,,,26162000AO0225,,,,,,,,,,,,,0,3,Dépendance,,0,S,sols,,,258,5.042824,45.291844
2023-286556,2023-02-09,000001,Vente,98500,50,,RUE COMMANDEUR,0115,26210,26162,Lens-Lestang,26,,,26162000AO0507,,,,,,,,,,,,,0,1,Maison,89,4,S,sols,,,89,5.042073,45.291889
2023-286760,2023-02-15,000001,Vente,1,,,LESTANG,B043,26210,26162,Lens-Lestang,26,,,26162000AV0339,,,,,,,,,,,,,0,,,,,S,sols,,,10,5.034841,45.295489
2023-286760,2023-02-15,000001,Vente,1,,,LESTANG,B043,26210,26162,Lens-Lestang,26,,,26162000AV0344,,,,,,,,,,,,,0,,,,,S,sols,,,352,5.035224,45.295425
2023-286760,2023-02-15,000001,Vente,1,,,LESTANG,B043,26210,26162,Lens-Lestang,26,,,26162000AV0351,,,,,,,,,,,,,0,,,,,S,sols,,,23,5.035155,45.295255
2023-286907,2023-02-17,000001,Vente,300500,5324,,LA SAONE,B062,26210,26162,Lens-Lestang,26,,,26162000AN0125,,,,,,,,,,,,,0,1,Maison,175,6,P,prés,,,2000,5.042176,45.296054
2023-286907,2023-02-17,000001,Vente,300500,5324,,LA SAONE,B062,26210,26162,Lens-Lestang,26,,,26162000AN0125,,,,,,,,,,,,,0,1,Maison,175,6,S,sols,,,700,5.042176,45.296054
2023-287138,2023-02-23,000001,Vente,720,,,LESTANG,B043,26210,26162,Lens-Lestang,26,,,26162000AV0050,,,,,,,,,,,,,0,,,,,T,terres,,,2365,5.034808,45.296599
2023-287138,2023-02-23,000001,Vente,720,,,LESTANG,B043,26210,26162,Lens-Lestang,26,,,26162000AV0110,,,,,,,,,,,,,0,,,,,BT,taillis simples,,,58,5.035471,45.296763
2023-287730,2023-03-14,000002,Vente,300.5,,,LES GARENNES ET BARBONNIER,B036,26210,26162,Lens-Lestang,26,,,26162000AM0225,,,,,,,,,,,,,0,,,,,BT,taillis simples,,,271,5.044703,45.296653
2023-287730,2023-03-14,000002,Vente,300.5,,,LES GARENNES ET BARBONNIER,B036,26210,26162,Lens-Lestang,26,,,26162000AM0291,,,,,,,,,,,,,0,,,,,BT,taillis simples,,,330,5.044511,45.296651
2023-287893,2023-03-20,000001,Vente,280,,,LE CHATENAY EST,B018,26210,26162,Lens-Lestang,26,,,26162000AH0043,,,,,,,,,,,,,0,,,,,BT,taillis simples,,,1115,5.051587,45.299682
2023-289235,2023-05-06,000001,Vente,10000,,,LA SAONE,B062,26210,26162,Lens-Lestang,26,,,26162000AN0159,,,,,,,,,,,,,0,,,,,BT,taillis simples,,,162,5.042956,45.296387
2023-289235,2023-05-06,000001,Vente,10000,,,LA SAONE,B062,26210,26162,Lens-Lestang,26,,,26162000AN0161,,,,,,,,,,,,,0,,,,,S,sols,,,544,5.042839,45.29629
2023-289423,2023-05-09,000001,Vente,70000,,,PRE PLANCHER,B059,26210,26162,Lens-Lestang,26,,,26162000AN0018,,,,,,,,,,,,,0,,,,,T,terres,,,2570,5.038435,45.294378
2023-289763,2023-05-25,000001,Vente,500,,,LA GRANDE RAIE,B038,26210,26162,Lens-Lestang,26,,,26162000ZE0037,,,,,,,,,,,,,0,,,,,T,terres,,,2030,5.054713,45.308155
2023-291059,2023-06-29,000001,Vente,93500,,,PRE PLANCHER,B059,26210,26162,Lens-Lestang,26,,,26162000AN0155,,,,,,,,,,,,,0,,,,,T,terres,,,1708,5.039338,45.294236
2023-291145,2023-06-26,000001,Vente,105,,,LES COTES,B028,26210,26162,Lens-Lestang,26,,,26162000AH0264,,,,,,,,,,,,,0,,,,,BT,taillis simples,,,8555,5.067566,45.294665
2023-292735,2023-09-06,000001,Vente,110000,,,LES GRANGES,B041,26210,26162,Lens-Lestang,26,,,26162000AO0597,,,,,,,,,,,,,0,,,,,T,terres,,,1092,5.035501,45.294543
2023-292735,2023-09-06,000001,Vente,110000,,,LES GRANGES,B041,26210,26162,Lens-Lestang,26,,,26162000AO0598,,,,,,,,,,,,,0,,,,,T,terres,,,3970,5.03443,45.294396
2023-292930,2023-09-12,000001,Vente,60000,,,LES CHARMES OUEST,B016,26210,26162,Lens-Lestang,26,,,26162000AK0190,,,,,,,,,,,,,0,,,,,BT,taillis simples,,,750,5.046023,45.287821
2023-292930,2023-09-12,000001,Vente,60000,,,LES CHARMES OUEST,B016,26210,26162,Lens-Lestang,26,,,26162000AK0191,,,,,,,,,,,,,0,,,,,L,landes,PATUR,Pâture plantée,1015,5.046688,45.287985
2023-292930,2023-09-12,000001,Vente,60000,,,LES CHARMES OUEST,B016,26210,26162,Lens-Lestang,26,,,26162000AK0192,,,,,,,,,,,,,0,,,,,L,landes,PATUR,Pâture plantée,1580,5.04652,45.288162
2023-292930,2023-09-12,000001,Vente,60000,,,LES CHARMES OUEST,B016,26210,26162,Lens-Lestang,26,,,26162000AK0193,,,,,,,,,,,,,0,,,,,BT,taillis simples,,,2085,5.04592,45.288037
2023-292930,2023-09-12,000001,Vente,60000,,,LES CHARMES OUEST,B016,26210,26162,Lens-Lestang,26,,,26162000AK0194,,,,,,,,,,,,,0,,,,,BT,taillis simples,,,1070,5.045587,45.288229
2023-292930,2023-09-12,000001,Vente,60000,,,LES CHARMES OUEST,B016,26210,26162,Lens-Lestang,26,,,26162000AK0195,,,,,,,,,,,,,0,,,,,L,landes,PATUR,Pâture plantée,750,5.04657,45.288354
2023-292930,2023-09-12,000001,Vente,60000,,,LES CHARMES OUEST,B016,26210,26162,Lens-Lestang,26,,,26162000AK0196,,,,,,,,,,,,,0,,,,,VI,vignes,,,1500,5.046369,45.288509
2023-292930,2023-09-12,000001,Vente,60000,,,LES CHARMES OUEST,B016,26210,26162,Lens-Lestang,26,,,26162000AK0196,,,,,,,,,,,,,0,,,,,L,landes,PATUR,Pâture plantée,1770,5.046369,45.288509
2023-292930,2023-09-12,000001,Vente,60000,,,LES CHARMES OUEST,B016,26210,26162,Lens-Lestang,26,,,26162000AK0197,,,,,,,,,,,,,0,,,,,L,landes,PATUR,Pâture plantée,2260,5.04569,45.288538
2023-292930,2023-09-12,000001,Vente,60000,,,LES CHARMES OUEST,B016,26210,26162,Lens-Lestang,26,,,26162000AK0199,,,,,,,,,,,,,0,,,,,BT,taillis simples,,,3870,5.046134,45.288996
2023-292930,2023-09-12,000001,Vente,60000,,,LES CHARMES OUEST,B016,26210,26162,Lens-Lestang,26,,,26162000AK0202,,,,,,,,,,,,,0,,,,,BT,taillis simples,,,1290,5.046239,45.28985
2023-293373,2023-01-19,000001,Adjudication,163000,,,LE PINET,B054,26210,26162,Lens-Lestang,26,,,26162000AO0070,,,,,,,,,,,,,0,,,,,S,sols,,,8,5.039706,45.293264
2023-293373,2023-01-19,000001,Adjudication,163000,45,,RUE DU PARC,0295,26210,26162,Lens-Lestang,26,,,26162000AO0071,,,,,,,,,,,,,0,1,Maison,90,4,J,jardins,POTAG,Jardin potager,520,5.039623,45.293193
2023-293534,2023-10-02,000001,Vente,2880,,,LE MARION,B045,26210,26162,Lens-Lestang,26,,,26162000AL0055,,,,,,,,,,,,,0,,,,,BT,taillis simples,,,320,5.049237,45.291627
2023-293895,2023-10-07,000001,Vente,169300,,,LE VILLAGE,B067,26210,26162,Lens-Lestang,26,,,26162000AO0090,,,,,,,,,,,,,0,,,,,S,sols,,,82,5.040497,45.292224
2023-293895,2023-10-07,000001,Vente,169300,185,,RTE DE MANTHES,0250,26210,26162,Lens-Lestang,26,,,26162000AO0091,,,,,,,,,,,,,0,1,Maison,180,6,S,sols,,,177,5.040621,45.292211
2023-293895,2023-10-07,000001,Vente,169300,205,,RTE DE MANTHES,0250,26210,26162,Lens-Lestang,26,,,26162000AO0465,,,,,,,,,,,,,0,,,,,S,sols,,,329,5.040492,45.292126
2023-294069,2023-10-18,000001,Vente,195000,,,LE PINET,B054,26210,26162,Lens-Lestang,26,,,26162000AO0070,,,,,,,,,,,,,0,,,,,S,sols,,,8,5.039706,45.293264
2023-294069,2023-10-18,000001,Vente,195000,45,,RUE DU PARC,0295,26210,26162,Lens-Lestang,26,,,26162000AO0071,,,,,,,,,,,,,0,1,Maison,90,4,J,jardins,POTAG,Jardin potager,520,5.039623,45.293193
2023-295168,2023-11-27,000001,Vente,900,,,LE COIN DE LA BRUYERE,B020,26210,26162,Lens-Lestang,26,,,26162000AI0038,,,,,,,,,,,,,0,,,,,P,prés,,,2670,5.066398,45.291128
2023-295168,2023-11-27,000001,Vente,900,,,LES CHARMES DE SAINT DIDIE,B015,26210,26162,Lens-Lestang,26,,,26162000AK0041,,,,,,,,,,,,,0,,,,,BT,taillis simples,,,1010,5.053984,45.288794
2023-295168,2023-11-27,000001,Vente,900,,,LES CHARMES DE SAINT DIDIE,B015,26210,26162,Lens-Lestang,26,,,26162000AK0062,,,,,,,,,,,,,0,,,,,P,prés,,,1740,5.053121,45.286488
2023-295168,2023-11-27,000001,Vente,900,,,LES CHARMES DE SAINT DIDIE,B015,26210,26162,Lens-Lestang,26,,,26162000AK0063,,,,,,,,,,,,,0,,,,,BT,taillis simples,,,800,5.052882,45.286489
2023-296172,2023-12-20,000001,Vente,13867,,,LES BOUTTES DU CHAMPLAS,B008,26210,26162,Lens-Lestang,26,,,26162000ZD0023,,,,,,,,,,,,,0,,,,,T,terres,,,25214,5.056091,45.313903
