id_mutation,date_mutation,numero_disposition,nature_mutation,valeur_fonciere,adresse_numero,adresse_suffixe,adresse_nom_voie,adresse_code_voie,code_postal,code_commune,nom_commune,code_departement,ancien_code_commune,ancien_nom_commune,id_parcelle,ancien_id_parcelle,numero_volume,lot1_numero,lot1_surface_carrez,lot2_numero,lot2_surface_carrez,lot3_numero,lot3_surface_carrez,lot4_numero,lot4_surface_carrez,lot5_numero,lot5_surface_carrez,nombre_lots,code_type_local,type_local,surface_reelle_bati,nombre_pieces_principales,code_nature_culture,nature_culture,code_nature_culture_speciale,nature_culture_speciale,surface_terrain,longitude,latitude
2023-297012,2023-01-28,000001,Vente,2471.16,,,LES LONGUES RAIES,B025,27600,27249,Fontaine-Bellenger,27,,,272490000B0160,,,,,,,,,,,,,0,,,,,T,terres,,,3070,1.257121,49.179904
2023-297013,2023-01-28,000002,Vente,9528.84,,,LES LONGUES RAIES,B025,27600,27249,Fontaine-Bellenger,27,,,272490000B0161,,,,,,,,,,,,,0,,,,,T,terres,,,7460,1.258676,49.180191
2023-297991,2023-03-09,000001,Vente,323000,11,,RUE DES VIGNES,0059,27600,27249,Fontaine-Bellenger,27,,,272490000B0294,,,,,,,,,,,,,0,3,Dépendance,,0,J,jardins,,,1305,1.268375,49.177564
2023-297991,2023-03-09,000001,Vente,323000,11,,RUE DES VIGNES,0059,27600,27249,Fontaine-Bellenger,27,,,272490000B0294,,,,,,,,,,,,,0,1,Maison,160,6,S,sols,,,500,1.268375,49.177564
2023-297991,2023-03-09,000001,Vente,323000,11,,RUE DES VIGNES,0059,27600,27249,Fontaine-Bellenger,27,,,272490000B0294,,,,,,,,,,,,,0,3,Dépendance,,0,S,sols,,,500,1.268375,49.177564
2023-297991,2023-03-09,000001,Vente,323000,11,,RUE DES VIGNES,0059,27600,27249,Fontaine-Bellenger,27,,,272490000B0294,,,,,,,,,,,,,0,1,Maison,160,6,J,jardins,,,1305,1.268375,49.177564
2023-299118,2023-04-14,000001,Vente,278500,,,LE VAL D AILLY,B038,27600,27249,Fontaine-Bellenger,27,,,272490000A0480,,,,,,,,,,,,,0,,,,,L,landes,FRICH,Friche,54,1.267207,49.18882
2023-299118,2023-04-14,000001,Vente,278500,33,,RUE DU BEAU VAL,0011,27600,27249,Fontaine-Bellenger,27,,,272490000A0481,,,,,,,,,,,,,0,3,Dépendance,,0,J,jardins,,,1329,1.26744,49.188665
2023-299118,2023-04-14,000001,Vente,278500,33,,RUE DU BEAU VAL,0011,27600,27249,Fontaine-Bellenger,27,,,272490000A0481,,,,,,,,,,,,,0,1,Maison,130,5,S,sols,,,500,1.26744,49.188665
2023-299118,2023-04-14,000001,Vente,278500,33,,RUE DU BEAU VAL,0011,27600,27249,Fontaine-Bellenger,27,,,272490000A0481,,,,,,,,,,,,,0,1,Maison,130,5,J,jardins,,,1329,1.26744,49.188665
2023-299118,2023-04-14,000001,Vente,278500,33,,RUE DU BEAU VAL,0011,27600,27249,Fontaine-Bellenger,27,,,272490000A0481,,,,,,,,,,,,,0,3,Dépendance,,0,S,sols,,,500,1.26744,49.188665
2023-299118,2023-04-14,000001,Vente,278500,,,LE VAL D AILLY,B038,27600,27249,Fontaine-Bellenger,27,,,272490000A0512,,,,,,,,,,,,,0,,,,,P,prés,,,16,1.267447,49.188874
2023-299118,2023-04-14,000001,Vente,278500,,,LE VAL D AILLY,B038,27600,27249,Fontaine-Bellenger,27,,,272490000A0513,,,,,,,,,,,,,0,,,,,L,landes,FRICH,Friche,8,1.2674,49.188898
2023-299814,2023-04-19,000001,Vente,510000,,,LE BOURG,B003,27600,27249,Fontaine-Bellenger,27,,,272490000A0342,,,,,,,,,,,,,0,,,,,VE,vergers,,,1108,1.266158,49.188784
2023-299814,2023-04-19,000001,Vente,510000,,,LE BOURG,B003,27600,27249,Fontaine-Bellenger,27,,,272490000A0343,,,,,,,,,,,,,0,,,,,VE,vergers,,,557,1.266348,49.18885
2023-299814,2023-04-19,000001,Vente,510000,8,,RUE DE LA MARE A ROUIR,0037,27600,27249,Fontaine-Bellenger,27,,,272490000A0344,,,,,,,,,,,,,0,1,Maison,125,5,S,sols,,,1568,1.266582,49.18897
2023-299814,2023-04-19,000001,Vente,510000,,,LE BOURG,B003,27600,27249,Fontaine-Bellenger,27,,,272490000A0345,,,,,,,,,,,,,0,,,,,VE,vergers,,,1075,1.266949,49.188991
2023-299814,2023-04-19,000001,Vente,510000,,,LE VAL D AILLY,B038,27600,27249,Fontaine-Bellenger,27,,,272490000A0476,,,,,,,,,,,,,0,,,,,L,landes,FRICH,Friche,58,1.266382,49.188554
2023-299814,2023-04-19,000001,Vente,510000,,,LE VAL D AILLY,B038,27600,27249,Fontaine-Bellenger,27,,,272490000A0478,,,,,,,,,,,,,0,,,,,L,landes,FRICH,Friche,61,1.266809,49.188701
2023-301151,2023-06-24,000001,Vente,240000,13,,CLOS MADRIE,0033,27600,27249,Fontaine-Bellenger,27,,,272490000A1026,,,,,,,,,,,,,0,1,Maison,105,5,S,sols,,,1094,1.265447,49.181388
2023-301548,2023-07-05,000001,Vente,196000,5,,RUE DES VOSGOSSES,0061,27600,27249,Fontaine-Bellenger,27,,,272490000C0240,,,,,,,,,,,,,0,1,Maison,75,2,S,sols,,,500,1.220211,49.175015
2023-301548,2023-07-05,000001,Vente,196000,5,,RUE DES VOSGOSSES,0061,27600,27249,Fontaine-Bellenger,27,,,272490000C0240,,,,,,,,,,,,,0,1,Maison,75,2,J,jardins,,,700,1.220211,49.175015
2023-303890,2023-09-20,000001,Vente,208000,1,,RES DU MOULIN,0038,27600,27249,Fontaine-Bellenger,27,,,272490000A0531,,,,,,,,,,,,,0,3,Dépendance,,0,J,jardins,,,514,1.266832,49.190098
2023-303890,2023-09-20,000001,Vente,208000,1,,RES DU MOULIN,0038,27600,27249,Fontaine-Bellenger,27,,,272490000A0531,,,,,,,,,,,,,0,1,Maison,101,6,J,jardins,,,514,1.266832,49.190098
2023-303890,2023-09-20,000001,Vente,208000,1,,RES DU MOULIN,0038,27600,27249,Fontaine-Bellenger,27,,,272490000A0531,,,,,,,,,,,,,0,3,Dépendance,,0,S,sols,,,500,1.266832,49.190098
2023-303890,2023-09-20,000001,Vente,208000,1,,RES DU MOULIN,0038,27600,27249,Fontaine-Bellenger,27,,,272490000A0531,,,,,,,,,,,,,0,1,Maison,101,6,S,sols,,,500,1.266832,49.190098
2023-304000,2023-08-31,000001,Vente,59000,,,LE BOURG,B003,27600,27249,Fontaine-Bellenger,27,,,272490000A1138,,,,,,,,,,,,,0,,,,,VE,vergers,,,996,1.259285,49.184606
2023-304000,2023-08-31,000001,Vente,59000,,,LE BOURG,B003,27600,27249,Fontaine-Bellenger,27,,,272490000A1140,,,,,,,,,,,,,0,,,,,VE,vergers,,,89,1.259226,49.18491
2023-304000,2023-08-31,000001,Vente,59000,,,LE BOURG,B003,27600,27249,Fontaine-Bellenger,27,,,272490000A1143,,,,,,,,,,,,,0,,,,,S,sols,,,96,1.259509,49.184434
2023-304000,2023-08-31,000001,Vente,59000,,,LE BOURG,B003,27600,27249,Fontaine-Bellenger,27,,,272490000A1147,,,,,,,,,,,,,0,,,,,S,sols,,,2,1.259296,49.184749
2023-304106,2023-09-16,000001,Vente,173000,4,,RES DU CLOS DU VAL D AILLY,0023,27600,27249,Fontaine-Bellenger,27,,,272490000A0708,,,,,,,,,,,,,0,1,Maison,88,4,AG,terrains d'agrément,,,567,1.264698,49.18627
2023-304106,2023-09-16,000001,Vente,173000,4,,RES DU CLOS DU VAL D AILLY,0023,27600,27249,Fontaine-Bellenger,27,,,272490000A0708,,,,,,,,,,,,,0,1,Maison,88,4,S,sols,,,500,1.264698,49.18627
2023-304718,2023-10-10,000001,Vente,85000,,,LE BOURG,B003,27600,27249,Fontaine-Bellenger,27,,,272490000A0491,,,,,,,,,,,,,0,,,,,J,jardins,,,2325,1.2664,49.188172
2023-304980,2023-10-14,000001,Vente,230000,6,B,RUE DU BEAU VAL,0011,27600,27249,Fontaine-Bellenger,27,,,272490000A1066,,,,,,,,,,,,,0,1,Maison,99,4,S,sols,,,742,1.264811,49.185001
2023-304980,2023-10-14,000001,Vente,230000,,,LE VAL D AILLY,B038,27600,27249,Fontaine-Bellenger,27,,,272490000A1069,,,,,,,,,,,,,0,,,,,S,sols,,,11,1.263974,49.185973
2023-304980,2023-10-14,000001,Vente,230000,,,LE VAL D AILLY,B038,27600,27249,Fontaine-Bellenger,27,,,272490000A1070,,,,,,,,,,,,,0,,,,,AG,terrains d'agrément,,,1049,1.264627,49.185373
2023-305158,2023-10-13,000001,Vente,180000,21,,CLOS MADRIE,0033,27600,27249,Fontaine-Bellenger,27,,,272490000A0995,,,,,,,,,,,,,0,1,Maison,86,5,S,sols,,,1041,1.264602,49.18166
2023-305262,2023-10-31,000001,Vente,58000,,,HAMEAU DE GOURNAY,B020,27600,27249,Fontaine-Bellenger,27,,,272490000B0666,,,,,,,,,,,,,0,,,,,AG,terrains d'agrément,,,790,1.264708,49.178593
2023-305262,2023-10-31,000001,Vente,58000,,,HAMEAU DE GOURNAY,B020,27600,27249,Fontaine-Bellenger,27,,,272490000B0667,,,,,,,,,,,,,0,,,,,AG,terrains d'agrément,,,28,1.265025,49.178697
2023-305262,2023-10-31,000001,Vente,58000,,,HAMEAU DE GOURNAY,B020,27600,27249,Fontaine-Bellenger,27,,,272490000B0668,,,,,,,,,,,,,0,,,,,AG,terrains d'agrément,,,61,1.264404,49.178466
2023-305581,2023-10-31,000001,Vente,363000,,,LE BOURG,B003,27600,27249,Fontaine-Bellenger,27,,,272490000A1139,,,,,,,,,,,,,0,,,,,VE,vergers,,,24,1.25933,49.184608
2023-305581,2023-10-31,000001,Vente,363000,10,,RUE DE ST QUENTIN,0052,27600,27249,Fontaine-Bellenger,27,,,272490000A1144,,,,,,,,,,,,,0,3,Dépendance,,0,S,sols,,,218,1.25944,49.184882
2023-305581,2023-10-31,000001,Vente,363000,10,,RUE DE ST QUENTIN,0052,27600,27249,Fontaine-Bellenger,27,,,272490000A1144,,,,,,,,,,,,,0,1,Maison,180,5,S,sols,,,218,1.25944,49.184882
2023-305581,2023-10-31,000001,Vente,363000,,,LE BOURG,B003,27600,27249,Fontaine-Bellenger,27,,,272490000A1145,,,,,,,,,,,,,0,,,,,S,sols,,,117,1.259633,49.184853
2023-305581,2023-10-31,000001,Vente,363000,,,LE BOURG,B003,27600,27249,Fontaine-Bellenger,27,,,272490000A1146,,,,,,,,,,,,,0,,,,,J,jardins,,,696,1.259461,49.184687
2023-305581,2023-10-31,000001,Vente,363000,,,LE BOURG,B003,27600,27249,Fontaine-Bellenger,27,,,272490000A1168,,,,,,,,,,,,,0,,,,,AG,terrains d'agrément,,,23,1.25967,49.184773
2023-305581,2023-10-31,000001,Vente,363000,,,LE BOURG,B003,27600,27249,Fontaine-Bellenger,27,,,272490000A1170,,,,,,,,,,,,,0,,,,,AG,terrains d'agrément,,,18,1.259626,49.184758
2023-306176,2023-11-14,000001,Vente,16000,,,LE GALARDON,B015,27600,27249,Fontaine-Bellenger,27,,,272490000B0195,,,,,,,,,,,,,0,,,,,BS,taillis sous futaie,,,15060,1.275881,49.175893
2023-306176,2023-11-14,000001,Vente,16000,,,LE GALARDON,B015,27600,27249,Fontaine-Bellenger,27,,,272490000B0200,,,,,,,,,,,,,0,,,,,BT,taillis simples,,,1232,1.277254,49.175028
2023-306313,2023-12-02,000001,Vente,167500,31,,RUE DU BEAU VAL,0011,27600,27249,Fontaine-Bellenger,27,,,272490000A1133,,,,,,,,,,,,,0,1,Maison,101,4,S,sols,,,819,1.267178,49.18851
2023-306313,2023-12-02,000001,Vente,167500,,,LE VAL D AILLY,B038,27600,27249,Fontaine-Bellenger,27,,,272490000A1135,,,,,,,,,,,,,0,,,,,AG,terrains d'agrément,,,785,1.2673,49.188335
