id_mutation,date_mutation,numero_disposition,nature_mutation,valeur_fonciere,adresse_numero,adresse_suffixe,adresse_nom_voie,adresse_code_voie,code_postal,code_commune,nom_commune,code_departement,ancien_code_commune,ancien_nom_commune,id_parcelle,ancien_id_parcelle,numero_volume,lot1_numero,lot1_surface_carrez,lot2_numero,lot2_surface_carrez,lot3_numero,lot3_surface_carrez,lot4_numero,lot4_surface_carrez,lot5_numero,lot5_surface_carrez,nombre_lots,code_type_local,type_local,surface_reelle_bati,nombre_pieces_principales,code_nature_culture,nature_culture,code_nature_culture_speciale,nature_culture_speciale,surface_terrain,longitude,latitude
2023-296523,2023-01-10,000001,Vente,5000,,,LE GALMIN,B166,27120,27448,Pacy-sur-Eure,27,,,274485100C0333,,,,,,,,,,,,,0,,,,,S,sols,,,4,1.359067,49.011465
2023-296523,2023-01-10,000001,Vente,5000,,,LE GALMIN,B166,27120,27448,Pacy-sur-Eure,27,,,274485100C0336,,,,,,,,,,,,,0,,,,,S,sols,,,174,1.359166,49.011288
2023-296829,2023-01-20,000001,Vente en l'état futur d'achèvement,428228.6,,,RUE EDOUARD ISAMBARD,0290,27120,27448,Pacy-sur-Eure,27,,,27448000AD0090,,,203,,,,,,,,,,1,,,,,,,,,,1.381707,49.014212
2023-296829,2023-01-20,000001,Vente en l'état futur d'achèvement,428228.6,,,RUE EDOUARD ISAMBARD,0290,27120,27448,Pacy-sur-Eure,27,,,27448000AD0090,,,106,106.67,,,,,,,,,1,,,,,,,,,,1.381707,49.014212
2023-296829,2023-01-20,000001,Vente en l'état futur d'achèvement,428228.6,,,RUE EDOUARD ISAMBARD,0290,27120,27448,Pacy-sur-Eure,27,,,27448000AD0090,,,204,,,,,,,,,,1,,,,,,,,,,1.381707,49.014212
2023-296961,2023-01-26,000002,Vente,5000,,,LE MOULINET,B041,27120,27448,Pacy-sur-Eure,27,,,27448000AI0641,,,,,,,,,,,,,0,,,,,AB,terrains a bâtir,,,134,1.373221,49.021227
2023-297072,2023-01-26,000001,Vente,300000,,,RUE EDOUARD ISAMBARD,0290,27120,27448,Pacy-sur-Eure,27,,,27448000AE0834,,,,,,,,,,,,,0,,,,,S,sols,,,128,1.378728,49.013974
2023-297135,2023-01-31,000001,Vente,171000,25,,RUE DE GAILLON,0200,27120,27448,Pacy-sur-Eure,27,,,27448000AE0033,,,,,,,,,,,,,0,1,Maison,80,3,S,sols,,,265,1.380613,49.017891
2023-297302,2023-01-24,000001,Vente,255000,10,,AV DU GENERAL DE GAULLE,0218,27120,27448,Pacy-sur-Eure,27,,,27448000AC0266,,,,,,,,,,,,,0,1,Maison,78,4,S,sols,,,1201,1.388303,49.01772
2023-297337,2023-01-31,000001,Vente,1055000,,,LA CITE LANGLOIS,B024,27120,27448,Pacy-sur-Eure,27,,,27448000AE0310,,,,,,,,,,,,,0,,,,,E,eaux,MARE,Mare,648,1.375684,49.013718
2023-297337,2023-01-31,000001,Vente,1055000,,,LE FAUBOURG,B030,27120,27448,Pacy-sur-Eure,27,,,27448000AE0343,,,,,,,,,,,,,0,,,,,E,eaux,MARE,Mare,2580,1.374834,49.015987
2023-297337,2023-01-31,000001,Vente,1055000,,,L ILE BARBAVENT,B035,27120,27448,Pacy-sur-Eure,27,,,27448000AH0078,,,,,,,,,,,,,0,,,,,P,prés,,,2463,1.368562,49.023709
2023-297337,2023-01-31,000001,Vente,1055000,,,LE MOULINET,B041,27120,27448,Pacy-sur-Eure,27,,,27448000AI0141,,,,,,,,,,,,,0,,,,,AG,terrains d'agrément,,,650,1.3713,49.024665
2023-297337,2023-01-31,000001,Vente,1055000,,,LE MOULINET,B041,27120,27448,Pacy-sur-Eure,27,,,27448000AI0141,,,,,,,,,,,,,0,,,,,P,prés,,,7837,1.3713,49.024665
2023-297337,2023-01-31,000001,Vente,1055000,,,LE MOULINET,B041,27120,27448,Pacy-sur-Eure,27,,,27448000AI0142,,,,,,,,,,,,,0,,,,,P,prés,,,5037,1.370215,49.023887
2023-297337,2023-01-31,000001,Vente,1055000,9009,,RUE DU MAL LECLERC,0385,27120,27448,Pacy-sur-Eure,27,,,27448000AI0143,,,,,,,,,,,,,0,1,Maison,75,3,J,jardins,POTAG,Jardin potager,1335,1.369727,49.024388
2023-297337,2023-01-31,000001,Vente,1055000,9009,,RUE DU MAL LECLERC,0385,27120,27448,Pacy-sur-Eure,27,,,27448000AI0143,,,,,,,,,,,,,0,1,Maison,75,3,S,sols,,,3222,1.369727,49.024388
2023-297337,2023-01-31,000001,Vente,1055000,9009,,RUE DU MAL LECLERC,0385,27120,27448,Pacy-sur-Eure,27,,,27448000AI0143,,,,,,,,,,,,,0,3,Dépendance,,0,S,sols,,,3222,1.369727,49.024388
2023-297337,2023-01-31,000001,Vente,1055000,9009,,RUE DU MAL LECLERC,0385,27120,27448,Pacy-sur-Eure,27,,,27448000AI0143,,,,,,,,,,,,,0,1,Maison,368,10,S,sols,,,3222,1.369727,49.024388
2023-297337,2023-01-31,000001,Vente,1055000,9009,,RUE DU MAL LECLERC,0385,27120,27448,Pacy-sur-Eure,27,,,27448000AI0143,,,,,,,,,,,,,0,1,Maison,75,3,P,prés,,,7175,1.369727,49.024388
2023-297337,2023-01-31,000001,Vente,1055000,9009,,RUE DU MAL LECLERC,0385,27120,27448,Pacy-sur-Eure,27,,,27448000AI0143,,,,,,,,,,,,,0,3,Dépendance,,0,P,prés,,,7175,1.369727,49.024388
2023-297337,2023-01-31,000001,Vente,1055000,9009,,RUE DU MAL LECLERC,0385,27120,27448,Pacy-sur-Eure,27,,,27448000AI0143,,,,,,,,,,,,,0,1,Maison,368,10,P,prés,,,7175,1.369727,49.024388
2023-297337,2023-01-31,000001,Vente,1055000,9009,,RUE DU MAL LECLERC,0385,27120,27448,Pacy-sur-Eure,27,,,27448000AI0143,,,,,,,,,,,,,0,3,Dépendance,,0,J,jardins,POTAG,Jardin potager,1335,1.369727,49.024388
2023-297337,2023-01-31,000001,Vente,1055000,9009,,RUE DU MAL LECLERC,0385,27120,27448,Pacy-sur-Eure,27,,,27448000AI0143,,,,,,,,,,,,,0,1,Maison,368,10,J,jardins,POTAG,Jardin potager,1335,1.369727,49.024388
2023-297337,2023-01-31,000001,Vente,1055000,,,LE MOULINET,B041,27120,27448,Pacy-sur-Eure,27,,,27448000AI0144,,,,,,,,,,,,,0,,,,,P,prés,,,148,1.368642,49.023762
2023-297337,2023-01-31,000001,Vente,1055000,,,LE MOULINET,B041,27120,27448,Pacy-sur-Eure,27,,,27448000AI0145,,,,,,,,,,,,,0,,,,,AG,terrains d'agrément,,,480,1.368628,49.024071
2023-297337,2023-01-31,000001,Vente,1055000,,,LE MOULINET,B041,27120,27448,Pacy-sur-Eure,27,,,27448000AI0146,,,,,,,,,,,,,0,,,,,AG,terrains d'agrément,,,178,1.368779,49.024549
2023-297337,2023-01-31,000001,Vente,1055000,,,LE MOULINET,B041,27120,27448,Pacy-sur-Eure,27,,,27448000AI0147,,,,,,,,,,,,,0,,,,,P,prés,,,6385,1.368519,49.024686
2023-297337,2023-01-31,000001,Vente,1055000,,,LE MOULINET,B041,27120,27448,Pacy-sur-Eure,27,,,27448000AI0152,,,,,,,,,,,,,0,,,,,E,eaux,MARE,Mare,4260,1.370335,49.022393
2023-297337,2023-01-31,000001,Vente,1055000,,,LE MOULAMBOURG,B039,27120,27448,Pacy-sur-Eure,27,,,27448000AI0154,,,,,,,,,,,,,0,,,,,E,eaux,MARE,Mare,1190,1.372118,49.019789
2023-297337,2023-01-31,000001,Vente,1055000,,,LE MOULAMBOURG,B039,27120,27448,Pacy-sur-Eure,27,,,27448000AI0500,,,,,,,,,,,,,0,,,,,E,eaux,MARE,Mare,755,1.372925,49.018439
2023-297408,2023-02-09,000001,Vente,273000,6,,RUE MANON LESCAUT,0360,27120,27448,Pacy-sur-Eure,27,,,27448000ZA0075,,,,,,,,,,,,,0,1,Maison,99,4,S,sols,,,1238,1.386146,49.018602
2023-297469,2023-02-01,000001,Vente,223000,7,B,CITE LANGLOIS,0320,27120,27448,Pacy-sur-Eure,27,,,27448000AE0326,,,,,,,,,,,,,0,1,Maison,120,6,J,jardins,POTAG,Jardin potager,740,1.373491,49.014433
2023-297469,2023-02-01,000001,Vente,223000,7,B,CITE LANGLOIS,0320,27120,27448,Pacy-sur-Eure,27,,,27448000AE0326,,,,,,,,,,,,,0,1,Maison,120,6,S,sols,,,495,1.373491,49.014433
2023-297469,2023-02-01,000001,Vente,223000,7,B,CITE LANGLOIS,0320,27120,27448,Pacy-sur-Eure,27,,,27448000AE0327,,,,,,,,,,,,,0,3,Dépendance,,0,S,sols,,,42,1.373441,49.014624
2023-297469,2023-02-01,000001,Vente,223000,7,B,CITE LANGLOIS,0320,27120,27448,Pacy-sur-Eure,27,,,27448000AE0327,,,,,,,,,,,,,0,3,Dépendance,,0,J,jardins,POTAG,Jardin potager,382,1.373441,49.014624
2023-297469,2023-02-01,000001,Vente,223000,7,B,CITE LANGLOIS,0320,27120,27448,Pacy-sur-Eure,27,,,27448000AE0327,,,,,,,,,,,,,0,3,Dépendance,,0,J,jardins,POTAG,Jardin potager,382,1.373441,49.014624
2023-297469,2023-02-01,000001,Vente,223000,7,B,CITE LANGLOIS,0320,27120,27448,Pacy-sur-Eure,27,,,27448000AE0327,,,,,,,,,,,,,0,3,Dépendance,,0,S,sols,,,42,1.373441,49.014624
2023-297555,2023-02-16,000001,Vente,1,9286,,LA SEIGNEURIE,B136,27120,27448,Pacy-sur-Eure,27,,,27448000ZB0286,,,,,,,,,,,,,0,4,Local industriel. commercial ou assimilé,540,0,S,sols,,,2670,1.398866,49.010818
2023-297561,2023-02-21,000001,Vente,313000,1,,RUE LUCILE RIQUIER,0340,27120,27448,Pacy-sur-Eure,27,,,27448000AE0010,,,,,,,,,,,,,0,3,Dépendance,,0,S,sols,,,599,1.37824,49.018828
2023-297561,2023-02-21,000001,Vente,313000,1,,RUE LUCILE RIQUIER,0340,27120,27448,Pacy-sur-Eure,27,,,27448000AE0010,,,,,,,,,,,,,0,1,Maison,99,3,S,sols,,,599,1.37824,49.018828
2023-297620,2023-02-17,000001,Vente,195000,21,,RUE DU MAL LECLERC,0385,27120,27448,Pacy-sur-Eure,27,,,27448000AI0089,,,,,,,,,,,,,0,1,Maison,76,5,S,sols,,,910,1.374527,49.020792
2023-297716,2023-02-18,000001,Vente,125000,16,B,RUE GUESPIN,0230,27120,27448,Pacy-sur-Eure,27,,,27448000AD0177,,,,,,,,,,,,,0,3,Dépendance,,0,S,sols,,,362,1.383365,49.012934
2023-297716,2023-02-18,000001,Vente,125000,16,B,RUE GUESPIN,0230,27120,27448,Pacy-sur-Eure,27,,,27448000AD0177,,,,,,,,,,,,,0,1,Maison,55,1,S,sols,,,362,1.383365,49.012934
2023-297716,2023-02-18,000001,Vente,125000,16,B,RUE GUESPIN,0230,27120,27448,Pacy-sur-Eure,27,,,27448000AD0177,,,,,,,,,,,,,0,1,Maison,20,1,S,sols,,,362,1.383365,49.012934
2023-297716,2023-02-18,000001,Vente,125000,16,B,RUE GUESPIN,0230,27120,27448,Pacy-sur-Eure,27,,,27448000AD0177,,,,,,,,,,,,,0,1,Maison,10,1,S,sols,,,362,1.383365,49.012934
2023-297716,2023-02-18,000001,Vente,125000,16,B,RUE GUESPIN,0230,27120,27448,Pacy-sur-Eure,27,,,27448000AD0177,,,,,,,,,,,,,0,3,Dépendance,,0,S,sols,,,362,1.383365,49.012934
2023-298007,2023-02-23,000001,Vente,280000,3,,RUE ALBERT CAMUS,0010,27120,27448,Pacy-sur-Eure,27,,,27448000AI0077,,,,,,,,,,,,,0,1,Maison,63,4,J,jardins,POTAG,Jardin potager,927,,
2023-298007,2023-02-23,000001,Vente,280000,3,,RUE ALBERT CAMUS,0010,27120,27448,Pacy-sur-Eure,27,,,27448000AI0077,,,,,,,,,,,,,0,1,Maison,63,4,S,sols,,,555,,
2023-298045,2023-03-03,000001,Vente,222500,61,,RUE ARISTIDE BRIAND,0020,27120,27448,Pacy-sur-Eure,27,,,27448000AE0370,,,,,,,,,,,,,0,3,Dépendance,,0,S,sols,,,130,1.377227,49.016507
2023-298045,2023-03-03,000001,Vente,222500,61,,RUE ARISTIDE BRIAND,0020,27120,27448,Pacy-sur-Eure,27,,,27448000AE0370,,,,,,,,,,,,,0,1,Maison,80,3,S,sols,,,130,1.377227,49.016507
2023-298062,2023-02-22,000001,Vente,120000,2,,RUE DE DREUX,0587,27120,27448,Pacy-sur-Eure,27,,,274485100B0595,,,,,,,,,,,,,0,4,Local industriel. commercial ou assimilé,298,0,S,sols,,,328,1.376943,49.011262
2023-298297,2023-02-24,000002,Vente,70000,,,CHE LATERAL,0325,27120,27448,Pacy-sur-Eure,27,,,27448000AD0678,,,,,,,,,,,,,0,,,,,S,sols,,,247,1.389785,49.011087
2023-298297,2023-02-24,000002,Vente,70000,,,CHE LATERAL,0325,27120,27448,Pacy-sur-Eure,27,,,27448000AD0679,,,,,,,,,,,,,0,,,,,S,sols,,,13,1.389588,49.010976
2023-298297,2023-02-24,000002,Vente,70000,,,CHE LATERAL,0325,27120,27448,Pacy-sur-Eure,27,,,27448000AD0680,,,,,,,,,,,,,0,,,,,S,sols,,,473,1.389954,49.01093
2023-298297,2023-02-24,000002,Vente,70000,,,CHE LATERAL,0325,27120,27448,Pacy-sur-Eure,27,,,27448000AD0681,,,,,,,,,,,,,0,,,,,S,sols,,,13,1.389669,49.010806
2023-298301,2023-02-24,000001,Vente,115000,17,,RUE DE LA PAIX,0460,27120,27448,Pacy-sur-Eure,27,,,27448000AD0676,,,,,,,,,,,,,0,1,Maison,80,3,S,sols,,,431,1.389896,49.011046
2023-298301,2023-02-24,000001,Vente,115000,,,CHE LATERAL,0325,27120,27448,Pacy-sur-Eure,27,,,27448000AD0677,,,,,,,,,,,,,0,,,,,S,sols,,,18,1.389629,49.010884
2023-298568,2023-03-28,000001,Vente,260000,9001,,RUE RENE PRIN,0492,27120,27448,Pacy-sur-Eure,27,,,27448000ZB0049,,,,,,,,,,,,,0,3,Dépendance,,0,S,sols,,,3583,1.389307,49.013886
2023-298568,2023-03-28,000001,Vente,260000,9001,,RUE RENE PRIN,0492,27120,27448,Pacy-sur-Eure,27,,,27448000ZB0049,,,,,,,,,,,,,0,2,Appartement,84,5,S,sols,,,3583,1.389307,49.013886
2023-298568,2023-03-28,000001,Vente,260000,9001,,RUE RENE PRIN,0492,27120,27448,Pacy-sur-Eure,27,,,27448000ZB0049,,,,,,,,,,,,,0,2,Appartement,72,4,S,sols,,,3583,1.389307,49.013886
2023-298568,2023-03-28,000001,Vente,260000,9001,,RUE RENE PRIN,0492,27120,27448,Pacy-sur-Eure,27,,,27448000ZB0049,,,,,,,,,,,,,0,2,Appartement,84,5,S,sols,,,3583,1.389307,49.013886
2023-298568,2023-03-28,000001,Vente,260000,9001,,RUE RENE PRIN,0492,27120,27448,Pacy-sur-Eure,27,,,27448000ZB0049,,,,,,,,,,,,,0,3,Dépendance,,0,S,sols,,,3583,1.389307,49.013886
2023-298568,2023-03-28,000001,Vente,260000,9001,,RUE RENE PRIN,0492,27120,27448,Pacy-sur-Eure,27,,,27448000ZB0049,,,,,,,,,,,,,0,3,Dépendance,,0,S,sols,,,3583,1.389307,49.013886
2023-298568,2023-03-28,000001,Vente,260000,9001,,RUE RENE PRIN,0492,27120,27448,Pacy-sur-Eure,27,,,27448000ZB0049,,,,,,,,,,,,,0,3,Dépendance,,0,S,sols,,,3583,1.389307,49.013886
2023-298568,2023-03-28,000001,Vente,260000,9001,,RUE RENE PRIN,0492,27120,27448,Pacy-sur-Eure,27,,,27448000ZB0049,,,,,,,,,,,,,0,3,Dépendance,,0,S,sols,,,3583,1.389307,49.013886
2023-298568,2023-03-28,000001,Vente,260000,9001,,RUE RENE PRIN,0492,27120,27448,Pacy-sur-Eure,27,,,27448000ZB0049,,,,,,,,,,,,,0,3,Dépendance,,0,S,sols,,,3583,1.389307,49.013886
2023-298568,2023-03-28,000001,Vente,260000,9001,,RUE RENE PRIN,0492,27120,27448,Pacy-sur-Eure,27,,,27448000ZB0049,,,,,,,,,,,,,0,2,Appartement,74,4,S,sols,,,3583,1.389307,49.013886
2023-298568,2023-03-28,000001,Vente,260000,9001,,RUE RENE PRIN,0492,27120,27448,Pacy-sur-Eure,27,,,27448000ZB0049,,,,,,,,,,,,,0,2,Appartement,63,3,S,sols,,,3583,1.389307,49.013886
2023-298568,2023-03-28,000001,Vente,260000,9001,,RUE RENE PRIN,0492,27120,27448,Pacy-sur-Eure,27,,,27448000ZB0049,,,,,,,,,,,,,0,2,Appartement,72,4,S,sols,,,3583,1.389307,49.013886
2023-298568,2023-03-28,000001,Vente,260000,9001,,RUE RENE PRIN,0492,27120,27448,Pacy-sur-Eure,27,,,27448000ZB0049,,,,,,,,,,,,,0,3,Dépendance,,0,S,sols,,,3583,1.389307,49.013886
2023-298568,2023-03-28,000001,Vente,260000,9001,,RUE RENE PRIN,0492,27120,27448,Pacy-sur-Eure,27,,,27448000ZB0049,,,,,,,,,,,,,0,3,Dépendance,,0,S,sols,,,3583,1.389307,49.013886
2023-298568,2023-03-28,000001,Vente,260000,9001,,RUE RENE PRIN,0492,27120,27448,Pacy-sur-Eure,27,,,27448000ZB0049,,,,,,,,,,,,,0,3,Dépendance,,0,S,sols,,,3583,1.389307,49.013886
2023-298568,2023-03-28,000001,Vente,260000,9001,,RUE RENE PRIN,0492,27120,27448,Pacy-sur-Eure,27,,,27448000ZB0049,,,,,,,,,,,,,0,3,Dépendance,,0,S,sols,,,3583,1.389307,49.013886
2023-298568,2023-03-28,000001,Vente,260000,9001,,RUE RENE PRIN,0492,27120,27448,Pacy-sur-Eure,27,,,27448000ZB0049,,,,,,,,,,,,,0,3,Dépendance,,0,S,sols,,,3583,1.389307,49.013886
2023-298568,2023-03-28,000001,Vente,260000,9001,,RUE RENE PRIN,0492,27120,27448,Pacy-sur-Eure,27,,,27448000ZB0049,,,,,,,,,,,,,0,3,Dépendance,,0,S,sols,,,3583,1.389307,49.013886
2023-298718,2023-04-03,000001,Vente,137000,9002,,RUE DE PACEL,0450,27120,27448,Pacy-sur-Eure,27,,,27448000AD0406,,,,,,,,,,,,,0,3,Dépendance,,0,S,sols,,,136,1.385012,49.0139
2023-298718,2023-04-03,000001,Vente,137000,,,RUE DE PACEL,0450,27120,27448,Pacy-sur-Eure,27,,,27448000AD0407,,,,,,,,,,,,,0,,,,,S,sols,,,39,1.385008,49.013722
2023-298718,2023-04-03,000001,Vente,137000,45,,RUE DE PACEL,0450,27120,27448,Pacy-sur-Eure,27,,,27448000AD0409,,,,,,,,,,,,,0,1,Maison,70,4,S,sols,,,45,1.38502,49.013657
2023-299008,2023-03-17,000001,Vente,110000,29,B,RUE EDOUARD ISAMBARD,0290,27120,27448,Pacy-sur-Eure,27,,,27448000AE0698,,,1,,,,,,,,,,1,3,Dépendance,,0,,,,,,1.37879,49.013843
2023-299008,2023-03-17,000001,Vente,110000,31,,RUE EDOUARD ISAMBARD,0290,27120,27448,Pacy-sur-Eure,27,,,27448000AE0719,,,,,,,,,,,,,0,1,Maison,50,2,S,sols,,,99,1.378826,49.013867
2023-299086,2023-03-27,000001,Vente,210000,14,,RUE HENRI DUNANT,0270,27120,27448,Pacy-sur-Eure,27,,,27448000AI0191,,,,,,,,,,,,,0,1,Maison,68,4,S,sols,,,573,1.376096,49.023267
2023-299241,2023-04-07,000001,Vente,650000,4,,RUE DU 18 JUIN 40,0316,27120,27448,Pacy-sur-Eure,27,,,27448000ZC0194,,,4,,6,,,,,,,,2,4,Local industriel. commercial ou assimilé,200,0,,,,,,1.398384,49.009892
2023-299241,2023-04-07,000001,Vente,650000,4,,RUE DU 18 JUIN 40,0316,27120,27448,Pacy-sur-Eure,27,,,27448000ZC0194,,,4,,6,,,,,,,,2,4,Local industriel. commercial ou assimilé,649,0,,,,,,1.398384,49.009892
2023-299241,2023-04-07,000001,Vente,650000,2,,RUE DU 18 JUIN 40,0316,27120,27448,Pacy-sur-Eure,27,,,27448000ZC0259,,,117,,,,,,,,,,1,4,Local industriel. commercial ou assimilé,520,0,,,,,,1.396967,49.009755
2023-299811,2023-04-17,000001,Vente,117000,23,,RUE MARCEL MOISSON,0590,27120,27448,Pacy-sur-Eure,27,,,274485100B0103,,,11,51.39,,,,,,,,,1,2,Appartement,60,3,,,,,,1.378623,49.011403
2023-299811,2023-04-17,000001,Vente,117000,23,,RUE MARCEL MOISSON,0590,27120,27448,Pacy-sur-Eure,27,,,274485100B0103,,,94,,,,,,,,,,1,3,Dépendance,,0,,,,,,1.378623,49.011403
2023-299820,2023-05-05,000001,Vente,152500,1,,RUE DE PACEL,0450,27120,27448,Pacy-sur-Eure,27,,,27448000AD0349,,,,,,,,,,,,,0,4,Local industriel. commercial ou assimilé,200,0,S,sols,,,235,1.381445,49.012941
2023-299820,2023-05-05,000001,Vente,152500,,,RUE DE PACEL,0450,27120,27448,Pacy-sur-Eure,27,,,27448000AD0351,,,,,,,,,,,,,0,,,,,S,sols,,,34,1.381431,49.012856
2023-299950,2023-04-27,000001,Vente,120000,7,,RUE DU VAL MORIN,0554,27120,27448,Pacy-sur-Eure,27,,,27448000ZB0260,,,,,,,,,,,,,0,1,Maison,126,5,S,sols,,,1012,1.392063,49.01476
2023-300014,2023-05-12,000001,Vente,182000,2,,RUE DU FAUBOURG,0179,27120,27448,Pacy-sur-Eure,27,,,27448000AE0619,,,20,,3,,,,,,,,2,3,Dépendance,,0,,,,,,1.376051,49.015027
2023-300014,2023-05-12,000001,Vente,182000,2,,RUE DU FAUBOURG,0179,27120,27448,Pacy-sur-Eure,27,,,27448000AE0619,,,20,,3,,,,,,,,2,2,Appartement,68,3,,,,,,1.376051,49.015027
2023-300014,2023-05-12,000001,Vente,182000,2,,RUE DU FAUBOURG,0179,27120,27448,Pacy-sur-Eure,27,,,27448000AE0619,,,77,,,,,,,,,,1,3,Dépendance,,0,,,,,,1.376051,49.015027
2023-300014,2023-05-12,000001,Vente,182000,2,,RUE DU FAUBOURG,0179,27120,27448,Pacy-sur-Eure,27,,,27448000AE0619,,,104,,,,,,,,,,1,3,Dépendance,,0,,,,,,1.376051,49.015027
2023-300015,2023-05-10,000001,Vente,185000,22,B,LES DROUARDS,B162,27120,27448,Pacy-sur-Eure,27,,,274485100B0416,,,,,,,,,,,,,0,1,Maison,81,4,S,sols,,,1154,1.379027,49.008847
2023-300192,2023-04-28,000001,Vente,435000,24,,RUE DU VAL MORIN,0554,27120,27448,Pacy-sur-Eure,27,,,27448000ZB0194,,,,,,,,,,,,,0,1,Maison,150,5,S,sols,,,500,1.394142,49.015111
2023-300192,2023-04-28,000001,Vente,435000,24,,RUE DU VAL MORIN,0554,27120,27448,Pacy-sur-Eure,27,,,27448000ZB0194,,,,,,,,,,,,,0,1,Maison,150,5,AG,terrains d'agrément,,,1040,1.394142,49.015111
2023-300813,2023-06-16,000001,Vente,263000,31,,RUE ARISTIDE BRIAND,0020,27120,27448,Pacy-sur-Eure,27,,,27448000AE0301,,,,,,,,,,,,,0,3,Dépendance,,0,S,sols,,,126,1.378193,49.014753
2023-300813,2023-06-16,000001,Vente,263000,31,,RUE ARISTIDE BRIAND,0020,27120,27448,Pacy-sur-Eure,27,,,27448000AE0301,,,,,,,,,,,,,0,1,Maison,145,6,S,sols,,,126,1.378193,49.014753
2023-300816,2023-06-16,000001,Vente,250000,28,,RUE DE LA VERDERIE,0557,27120,27448,Pacy-sur-Eure,27,,,27448000ZA0574,,,,,,,,,,,,,0,1,Maison,80,4,S,sols,,,505,1.383546,49.021815
2023-300888,2023-06-14,000001,Vente,130000,12,,RUE MARCEL MOISSON,0590,27120,27448,Pacy-sur-Eure,27,,,274485100B0053,,,,,,,,,,,,,0,1,Maison,75,2,S,sols,,,856,1.377224,49.012974
2023-300888,2023-06-14,000001,Vente,130000,12,,RUE MARCEL MOISSON,0590,27120,27448,Pacy-sur-Eure,27,,,274485100B0053,,,,,,,,,,,,,0,1,Maison,110,4,S,sols,,,856,1.377224,49.012974
2023-301316,2023-06-08,000001,Vente,178000,14,,RUE DES CRIEURS,0100,27120,27448,Pacy-sur-Eure,27,,,27448000AE0822,,,,,,,,,,,,,0,1,Maison,84,4,S,sols,,,61,1.377673,49.013575
2023-301326,2023-06-30,000001,Vente,155000,2,,RUE DE NORMANDIE,0430,27120,27448,Pacy-sur-Eure,27,,,27448000AE0715,,,,,,,,,,,,,0,2,Appartement,63,3,S,sols,,,407,1.378357,49.019053
2023-301401,2023-06-22,000001,Vente,260000,32,,RUE PASTEUR,0470,27120,27448,Pacy-sur-Eure,27,,,27448000AI0526,,,,,,,,,,,,,0,3,Dépendance,,0,S,sols,,,673,1.373115,49.019104
2023-301401,2023-06-22,000001,Vente,260000,32,,RUE PASTEUR,0470,27120,27448,Pacy-sur-Eure,27,,,27448000AI0526,,,,,,,,,,,,,0,1,Maison,110,4,S,sols,,,673,1.373115,49.019104
2023-301485,2023-06-23,000002,Vente,155000,,,LA MALADRERIE,B036,27120,27448,Pacy-sur-Eure,27,,,27448000AI0650,,,,,,,,,,,,,0,,,,,J,jardins,POTAG,Jardin potager,476,1.373086,49.023202
2023-301485,2023-06-23,000002,Vente,155000,,,LA MALADRERIE,B036,27120,27448,Pacy-sur-Eure,27,,,27448000AI0651,,,,,,,,,,,,,0,,,,,J,jardins,POTAG,Jardin potager,475,1.37311,49.022996
2023-301485,2023-06-23,000002,Vente,155000,,,LA MALADRERIE,B036,27120,27448,Pacy-sur-Eure,27,,,27448000AI0652,,,,,,,,,,,,,0,,,,,J,jardins,POTAG,Jardin potager,475,1.373318,49.023126
2023-301485,2023-06-23,000002,Vente,155000,,,LA MALADRERIE,B036,27120,27448,Pacy-sur-Eure,27,,,27448000AI0653,,,,,,,,,,,,,0,,,,,J,jardins,POTAG,Jardin potager,8,1.373115,49.022927
2023-301623,2023-06-20,000001,Vente,220000,25,A,RUE DU MAL LECLERC,0385,27120,27448,Pacy-sur-Eure,27,,,27448000AI0612,,,,,,,,,,,,,0,1,Maison,79,4,S,sols,,,224,1.374138,49.021349
2023-301623,2023-06-20,000001,Vente,220000,,,LE MOULAMBOURG,B039,27120,27448,Pacy-sur-Eure,27,,,27448000AI0614,,,,,,,,,,,,,0,,,,,S,sols,,,93,1.373513,49.021139
2023-301623,2023-06-20,000001,Vente,220000,,,LE MOULAMBOURG,B039,27120,27448,Pacy-sur-Eure,27,,,27448000AI0615,,,,,,,,,,,,,0,,,,,S,sols,,,317,1.373993,49.021256
2023-301812,2023-06-30,000002,Vente,1100000,22,,RUE ALBERT CAMUS,0010,27120,27448,Pacy-sur-Eure,27,,,27448000AB0233,,,,,,,,,,,,,0,1,Maison,105,4,,,,,,1.377004,49.024162
2023-301812,2023-06-30,000002,Vente,1100000,22,,RUE ALBERT CAMUS,0010,27120,27448,Pacy-sur-Eure,27,,,27448000AB0233,,,,,,,,,,,,,0,3,Dépendance,,0,,,,,,1.377004,49.024162
2023-302030,2023-07-18,000001,Vente,359000,2,B,RUE DES FAUVETTES,0180,27120,27448,Pacy-sur-Eure,27,,,27448000AE0437,,,,,,,,,,,,,0,1,Maison,125,5,S,sols,,,735,1.375824,49.018255
2023-302034,2023-07-20,000001,Vente,250000,11,,RUE GUYNEMER,0240,27120,27448,Pacy-sur-Eure,27,,,27448000AI0247,,,,,,,,,,,,,0,1,Maison,67,4,S,sols,,,628,1.374586,49.022954
2023-302389,2023-07-20,000001,Vente,268000,8,,RUE D IVRY LA BATAILLE,0305,27120,27448,Pacy-sur-Eure,27,,,27448000AD0354,,,,,,,,,,,,,0,1,Maison,72,3,AG,terrains d'agrément,,,980,1.387195,49.011876
2023-302389,2023-07-20,000001,Vente,268000,8,,RUE D IVRY LA BATAILLE,0305,27120,27448,Pacy-sur-Eure,27,,,27448000AD0354,,,,,,,,,,,,,0,1,Maison,72,3,S,sols,,,144,1.387195,49.011876
2023-302460,2023-07-31,000001,Vente,151000,8,,RUE HECTOR BERLIOZ,0250,27120,27448,Pacy-sur-Eure,27,,,27448000AI0260,,,,,,,,,,,,,0,1,Maison,54,3,S,sols,,,505,1.37638,49.021926
2023-302575,2023-07-13,000002,Vente,200000,69,B,RUE EDOUARD ISAMBARD,0290,27120,27448,Pacy-sur-Eure,27,,,27448000AE0723,,,1,,,,,,,,,,1,4,Local industriel. commercial ou assimilé,5,0,,,,,,1.380214,49.014104
2023-302575,2023-07-13,000002,Vente,200000,69,,RUE EDOUARD ISAMBARD,0290,27120,27448,Pacy-sur-Eure,27,,,27448000AE0828,,,,,,,,,,,,,0,4,Local industriel. commercial ou assimilé,140,0,S,sols,,,43,1.380214,49.014138
2023-303468,2023-08-25,000001,Vente,250000,7,,RUE DES HAUTES FEUILLES,0246,27120,27448,Pacy-sur-Eure,27,,,27448000ZA0560,,,,,,,,,,,,,0,1,Maison,101,4,S,sols,,,557,1.384632,49.022449
2023-303492,2023-08-29,000001,Vente,250000,94,,RUE ARISTIDE BRIAND,0020,27120,27448,Pacy-sur-Eure,27,,,27448000AE0508,,,,,,,,,,,,,0,1,Maison,104,6,S,sols,,,643,1.377045,49.018608
2023-303964,2023-09-18,000002,Vente,181000,,,PACEL,B043,27120,27448,Pacy-sur-Eure,27,,,27448000AD0185,,,,,,,,,,,,,0,,,,,S,sols,,,60,1.383053,49.013023
2023-303964,2023-09-18,000002,Vente,181000,,,RUE DE PACEL,0450,27120,27448,Pacy-sur-Eure,27,,,27448000AD0673,,,,,,,,,,,,,0,,,,,S,sols,,,235,1.382993,49.012803
2023-303964,2023-09-18,000002,Vente,181000,,,RUE DE PACEL,0450,27120,27448,Pacy-sur-Eure,27,,,27448000AD0675,,,,,,,,,,,,,0,,,,,S,sols,,,47,1.382971,49.012897
2023-304220,2023-09-06,000001,Vente,229000,14,,AV PHILIPPE AUGUSTE,0477,27120,27448,Pacy-sur-Eure,27,,,27448000ZA0212,,,,,,,,,,,,,0,1,Maison,105,5,S,sols,,,503,1.387743,49.021613
2023-304248,2023-09-28,000001,Vente,232000,1,,ALL DU CLOS QUENOT,0087,27120,27448,Pacy-sur-Eure,27,,,27448000AC0543,,,,,,,,,,,,,0,1,Maison,80,3,S,sols,,,489,1.385595,49.015391
2023-304248,2023-09-28,000001,Vente,232000,2,,ALL DU CLOS QUENOT,0087,27120,27448,Pacy-sur-Eure,27,,,27448000AC0547,,,,,,,,,,,,,0,,,,,S,sols,,,1,1.38541,49.0155
2023-304248,2023-09-28,000001,Vente,232000,2,,ALL DU CLOS QUENOT,0087,27120,27448,Pacy-sur-Eure,27,,,27448000AC0554,,,,,,,,,,,,,0,,,,,S,sols,,,9,1.385446,49.015522
2023-304628,2023-10-06,000001,Vente,163000,58,,RUE MARCEL MOISSON,0590,27120,27448,Pacy-sur-Eure,27,,,274485100B0017,,,,,,,,,,,,,0,3,Dépendance,,0,S,sols,,,196,1.376268,49.011675