id_mutation,date_mutation,numero_disposition,nature_mutation,valeur_fonciere,adresse_numero,adresse_suffixe,adresse_nom_voie,adresse_code_voie,code_postal,code_commune,nom_commune,code_departement,ancien_code_commune,ancien_nom_commune,id_parcelle,ancien_id_parcelle,numero_volume,lot1_numero,lot1_surface_carrez,lot2_numero,lot2_surface_carrez,lot3_numero,lot3_surface_carrez,lot4_numero,lot4_surface_carrez,lot5_numero,lot5_surface_carrez,nombre_lots,code_type_local,type_local,surface_reelle_bati,nombre_pieces_principales,code_nature_culture,nature_culture,code_nature_culture_speciale,nature_culture_speciale,surface_terrain,longitude,latitude
2023-316422,2023-01-20,000001,Vente,300000,28,,RUE LUC ROBET,0512,29100,29226,Poullan-sur-Mer,29,,,29226000ZN0344,,,,,,,,,,,,,0,1,Maison,216,6,S,sols,,,700,-4.408311,48.082253
2023-316422,2023-01-20,000001,Vente,300000,28,,RUE LUC ROBET,0512,29100,29226,Poullan-sur-Mer,29,,,29226000ZN0344,,,,,,,,,,,,,0,1,Maison,216,6,J,jardins,,,1528,-4.408311,48.082253
2023-316422,2023-01-20,000001,Vente,300000,,,LE BOURG,B004,29100,29226,Poullan-sur-Mer,29,,,29226000ZN0365,,,,,,,,,,,,,0,,,,,S,sols,,,800,-4.408219,48.081897
2023-317083,2023-02-10,000001,Vente,73000,,,MENEZ AR VEIL AVEL,B103,29100,29226,Poullan-sur-Mer,29,,,29226000ZW0084,,,,,,,,,,,,,0,,,,,T,terres,,,1325,-4.373876,48.056935
2023-317083,2023-02-10,000001,Vente,73000,,,MENEZ AR VEIL AVEL,B103,29100,29226,Poullan-sur-Mer,29,,,29226000ZW0085,,,,,,,,,,,,,0,,,,,S,sols,,,1865,-4.373782,48.05713
2023-317083,2023-02-10,000001,Vente,73000,,,MENEZ AR VEIL AVEL,B103,29100,29226,Poullan-sur-Mer,29,,,29226000ZW0106,,,,,,,,,,,,,0,,,,,T,terres,,,196,-4.373445,48.057194
2023-317083,2023-02-10,000001,Vente,73000,274,,MENEZ AR VEIL AVEL,B103,29100,29226,Poullan-sur-Mer,29,,,29226000ZW0109,,,,,,,,,,,,,0,3,Dépendance,,0,T,terres,,,5662,-4.373161,48.056814
2023-317083,2023-02-10,000001,Vente,73000,274,,MENEZ AR VEIL AVEL,B103,29100,29226,Poullan-sur-Mer,29,,,29226000ZW0109,,,,,,,,,,,,,0,3,Dépendance,,0,S,sols,,,130,-4.373161,48.056814
2023-317083,2023-02-10,000001,Vente,73000,274,,MENEZ AR VEIL AVEL,B103,29100,29226,Poullan-sur-Mer,29,,,29226000ZW0109,,,,,,,,,,,,,0,3,Dépendance,,0,S,sols,,,130,-4.373161,48.056814
2023-317083,2023-02-10,000001,Vente,73000,274,,MENEZ AR VEIL AVEL,B103,29100,29226,Poullan-sur-Mer,29,,,29226000ZW0109,,,,,,,,,,,,,0,3,Dépendance,,0,T,terres,,,5662,-4.373161,48.056814
2023-317083,2023-02-10,000001,Vente,73000,274,,MENEZ AR VEIL AVEL,B103,29100,29226,Poullan-sur-Mer,29,,,29226000ZW0109,,,,,,,,,,,,,0,1,Maison,32,1,S,sols,,,130,-4.373161,48.056814
2023-317083,2023-02-10,000001,Vente,73000,274,,MENEZ AR VEIL AVEL,B103,29100,29226,Poullan-sur-Mer,29,,,29226000ZW0109,,,,,,,,,,,,,0,1,Maison,32,1,T,terres,,,5662,-4.373161,48.056814
2023-317195,2023-02-21,000001,Vente,150000,226,,LE DINVES,B015,29100,29226,Poullan-sur-Mer,29,,,29226000YE0073,,,,,,,,,,,,,0,1,Maison,105,4,S,sols,,,185,-4.364088,48.062127
2023-317195,2023-02-21,000001,Vente,150000,,,LE DINVES,B015,29100,29226,Poullan-sur-Mer,29,,,29226000YE0074,,,,,,,,,,,,,0,,,,,T,terres,,,796,-4.364029,48.062155
2023-317195,2023-02-21,000001,Vente,150000,,,LE DINVES,B015,29100,29226,Poullan-sur-Mer,29,,,29226000YE0074,,,,,,,,,,,,,0,,,,,T,terres,,,618,-4.364029,48.062155
2023-317195,2023-02-21,000001,Vente,150000,,,LE DINVES,B015,29100,29226,Poullan-sur-Mer,29,,,29226000YE0074,,,,,,,,,,,,,0,,,,,S,sols,,,461,-4.364029,48.062155
2023-317195,2023-02-21,000001,Vente,150000,,,LE MONT,B106,29100,29226,Poullan-sur-Mer,29,,,29226000YE0125,,,,,,,,,,,,,0,,,,,T,terres,,,2000,-4.363849,48.062329
2023-317396,2023-02-25,000001,Vente,140000,,,KERANDRAON,B145,29100,29226,Poullan-sur-Mer,29,,,29226000ZE0037,,,,,,,,,,,,,0,,,,,BF,futaies feuillues,,,1040,-4.408199,48.101851
2023-317396,2023-02-25,000001,Vente,140000,5101,,KERANDRAON,B145,29100,29226,Poullan-sur-Mer,29,,,29226000ZE0084,,,,,,,,,,,,,0,1,Maison,192,9,S,sols,,,1675,-4.411135,48.102599
2023-317396,2023-02-25,000001,Vente,140000,,,KERANDRAON,B145,29100,29226,Poullan-sur-Mer,29,,,29226000ZE0120,,,,,,,,,,,,,0,,,,,S,sols,,,460,-4.411368,48.102613
2023-317396,2023-02-25,000001,Vente,140000,,,KERANDRAON,B145,29100,29226,Poullan-sur-Mer,29,,,29226000ZE0121,,,,,,,,,,,,,0,,,,,L,landes,,,230,-4.408899,48.102115
2023-317396,2023-02-25,000001,Vente,140000,,,KERANDRAON,B145,29100,29226,Poullan-sur-Mer,29,,,29226000ZE0127,,,,,,,,,,,,,0,,,,,T,terres,,,86,-4.411244,48.102364
2023-317396,2023-02-25,000001,Vente,140000,,,KERANDRAON,B145,29100,29226,Poullan-sur-Mer,29,,,29226000ZE0140,,,,,,,,,,,,,0,,,,,L,landes,,,2715,-4.40941,48.102292
2023-317396,2023-02-25,000001,Vente,140000,,,KERANDRAON,B145,29100,29226,Poullan-sur-Mer,29,,,29226000ZE0140,,,,,,,,,,,,,0,,,,,T,terres,,,2780,-4.40941,48.102292
2023-317396,2023-02-25,000001,Vente,140000,,,KERANDRAON,B145,29100,29226,Poullan-sur-Mer,29,,,29226000ZE0140,,,,,,,,,,,,,0,,,,,L,landes,,,696,-4.40941,48.102292
2023-317396,2023-02-25,000001,Vente,140000,,,KERANDRAON,B145,29100,29226,Poullan-sur-Mer,29,,,29226000ZE0145,,,,,,,,,,,,,0,,,,,T,terres,,,330,-4.411451,48.102494
2023-317396,2023-02-25,000001,Vente,140000,,,KERANDRAON,B145,29100,29226,Poullan-sur-Mer,29,,,29226000ZE0152,,,,,,,,,,,,,0,,,,,T,terres,,,67,-4.410813,48.102778
2023-317396,2023-02-25,000001,Vente,140000,,,KERANDRAON,B145,29100,29226,Poullan-sur-Mer,29,,,29226000ZE0155,,,,,,,,,,,,,0,,,,,S,sols,,,1797,-4.411034,48.102772
2023-317806,2023-02-17,000001,Vente,205000,13,,RUE LUC ROBET,0512,29100,29226,Poullan-sur-Mer,29,,,29226000YC0214,,,,,,,,,,,,,0,1,Maison,74,3,S,sols,,,200,-4.411329,48.081844
2023-317806,2023-02-17,000001,Vente,205000,,,LE BOURG,B004,29100,29226,Poullan-sur-Mer,29,,,29226000YC0349,,,,,,,,,,,,,0,,,,,P,prés,,,181,-4.411399,48.081996
2023-317806,2023-02-17,000001,Vente,205000,,,KERMENEZ,B069,29100,29226,Poullan-sur-Mer,29,,,29226000ZI0318,,,,,,,,,,,,,0,,,,,P,prés,,,20,-4.411414,48.0821
2023-317884,2023-03-02,000001,Vente,260000,16,,RUE PENN AR YEUN,0667,29100,29226,Poullan-sur-Mer,29,,,29226000ZN0392,,,,,,,,,,,,,0,1,Maison,98,5,S,sols,,,620,-4.415415,48.078537
2023-318225,2023-02-07,000001,Vente,350000,,,PENNARUN,B112,29100,29226,Poullan-sur-Mer,29,,,29226000ZA0225,,,,,,,,,,,,,0,,,,,L,landes,,,4035,-4.447731,48.088949
2023-318413,2023-03-23,000001,Vente,32000,,,MESCOSQUER,B105,29100,29226,Poullan-sur-Mer,29,,,29226000ZN0493,,,,,,,,,,,,,0,,,,,AB,terrains a bâtir,,,555,-4.416285,48.07813
2023-318464,2023-03-17,000001,Vente,120000,,,CORNOU GLAZ,B012,29100,29226,Poullan-sur-Mer,29,,,29226000ZW0079,,,,,,,,,,,,,0,,,,,T,terres,,,1368,-4.381927,48.044895
2023-318464,2023-03-17,000001,Vente,120000,269,,CORNOU GLAZ,B012,29100,29226,Poullan-sur-Mer,29,,,29226000ZW0080,,,,,,,,,,,,,0,1,Maison,128,6,S,sols,,,269,-4.38172,48.044914
2023-318464,2023-03-17,000001,Vente,120000,,,CORNOU GLAZ,B012,29100,29226,Poullan-sur-Mer,29,,,29226000ZW0128,,,,,,,,,,,,,0,,,,,L,landes,,,421,-4.381633,48.044781
2023-318480,2023-03-07,000001,Vente,34375.5,,,LESCONIL,B094,29100,29226,Poullan-sur-Mer,29,,,29226000ZM0288,,,,,,,,,,,,,0,,,,,L,landes,,,4531,-4.372662,48.08713
2023-318480,2023-03-07,000001,Vente,34375.5,,,LESCONIL,B094,29100,29226,Poullan-sur-Mer,29,,,29226000ZM0288,,,,,,,,,,,,,0,,,,,T,terres,,,47065,-4.372662,48.08713
2023-318480,2023-03-07,000001,Vente,34375.5,,,LESCONIL,B094,29100,29226,Poullan-sur-Mer,29,,,29226000ZM0288,,,,,,,,,,,,,0,,,,,L,landes,,,1864,-4.372662,48.08713
2023-318598,2023-03-30,000001,Vente,1704,,,KERNAVENO,B072,29100,29226,Poullan-sur-Mer,29,,,29226000YE0052,,,,,,,,,,,,,0,,,,,T,terres,,,4260,-4.357519,48.066755
2023-319313,2023-05-02,000001,Vente,24250,,,MESCOSQUER,B105,29100,29226,Poullan-sur-Mer,29,,,29226000ZN0499,,,,,,,,,,,,,0,,,,,AB,terrains a bâtir,,,485,-4.415477,48.078047
2023-319461,2023-05-02,000001,Vente,259000,5121,,RTE DE DOUARNENEZ,0170,29100,29226,Poullan-sur-Mer,29,,,29226000ZN0315,,,,,,,,,,,,,0,1,Maison,117,5,T,terres,,,1843,-4.405671,48.083101
2023-319461,2023-05-02,000001,Vente,259000,5121,,RTE DE DOUARNENEZ,0170,29100,29226,Poullan-sur-Mer,29,,,29226000ZN0315,,,,,,,,,,,,,0,1,Maison,117,5,S,sols,,,700,-4.405671,48.083101
2023-320120,2023-05-30,000001,Vente,215000,7,,IMP DES HIRONDELLES,0350,29100,29226,Poullan-sur-Mer,29,,,29226000YD0069,,,,,,,,,,,,,0,1,Maison,120,5,S,sols,,,580,-4.370014,48.083232
2023-320456,2023-05-23,000001,Vente,29150,,,MESCOSQUER,B105,29100,29226,Poullan-sur-Mer,29,,,29226000ZN0584,,,,,,,,,,,,,0,,,,,AB,terrains a bâtir,,,530,-4.415868,48.077148
2023-320502,2023-06-08,000001,Vente,34485,,,MESCOSQUER,B105,29100,29226,Poullan-sur-Mer,29,,,29226000ZN0485,,,,,,,,,,,,,0,,,,,AB,terrains a bâtir,,,216,-4.415648,48.077165
2023-320502,2023-06-08,000001,Vente,34485,,,MESCOSQUER,B105,29100,29226,Poullan-sur-Mer,29,,,29226000ZN0507,,,,,,,,,,,,,0,,,,,AB,terrains a bâtir,,,384,-4.415545,48.07717
2023-320502,2023-06-08,000001,Vente,34485,,,MESCOSQUER,B105,29100,29226,Poullan-sur-Mer,29,,,29226000ZN0513,,,,,,,,,,,,,0,,,,,AB,terrains a bâtir,,,27,-4.41551,48.076994
2023-320503,2023-05-26,000001,Vente,59570,,,KERFINIDANT BRAS,B042,29100,29226,Poullan-sur-Mer,29,,,29226000YA0027,,,,,,,,,,,,,0,,,,,L,landes,,,6290,-4.391942,48.064719
2023-320503,2023-05-26,000001,Vente,59570,,,KERFINIDANT BRAS,B042,29100,29226,Poullan-sur-Mer,29,,,29226000YA0027,,,,,,,,,,,,,0,,,,,L,landes,,,6075,-4.391942,48.064719
2023-320503,2023-05-26,000001,Vente,59570,,,KERFINIDANT BRAS,B042,29100,29226,Poullan-sur-Mer,29,,,29226000YA0027,,,,,,,,,,,,,0,,,,,P,prés,,,5380,-4.391942,48.064719
2023-320503,2023-05-26,000001,Vente,59570,,,KERFINIDANT BRAS,B042,29100,29226,Poullan-sur-Mer,29,,,29226000YA0027,,,,,,,,,,,,,0,,,,,L,landes,,,6075,-4.391942,48.064719
2023-320503,2023-05-26,000001,Vente,59570,,,KEREDEC,B035,29100,29226,Poullan-sur-Mer,29,,,29226000YB0006,,,,,,,,,,,,,0,,,,,P,prés,,,17526,-4.393396,48.06196
2023-320503,2023-05-26,000001,Vente,59570,,,KEREDEC,B035,29100,29226,Poullan-sur-Mer,29,,,29226000YB0006,,,,,,,,,,,,,0,,,,,L,landes,,,1601,-4.393396,48.06196
2023-320503,2023-05-26,000001,Vente,59570,,,KEREDEC,B035,29100,29226,Poullan-sur-Mer,29,,,29226000YB0006,,,,,,,,,,,,,0,,,,,L,landes,,,8378,-4.393396,48.06196
2023-320503,2023-05-26,000001,Vente,59570,,,KEREDEC,B035,29100,29226,Poullan-sur-Mer,29,,,29226000YB0006,,,,,,,,,,,,,0,,,,,P,prés,,,5975,-4.393396,48.06196
2023-320503,2023-05-26,000001,Vente,59570,,,KEREDEC,B035,29100,29226,Poullan-sur-Mer,29,,,29226000YB0006,,,,,,,,,,,,,0,,,,,L,landes,,,9956,-4.393396,48.06196
2023-320503,2023-05-26,000001,Vente,59570,,,KEREDEC,B035,29100,29226,Poullan-sur-Mer,29,,,29226000YB0006,,,,,,,,,,,,,0,,,,,L,landes,,,4978,-4.393396,48.06196
2023-320503,2023-05-26,000001,Vente,59570,,,KEREDEC,B035,29100,29226,Poullan-sur-Mer,29,,,29226000YB0006,,,,,,,,,,,,,0,,,,,T,terres,,,11661,-4.393396,48.06196
2023-320503,2023-05-26,000001,Vente,59570,,,KEREDEC,B035,29100,29226,Poullan-sur-Mer,29,,,29226000YB0006,,,,,,,,,,,,,0,,,,,T,terres,,,1341,-4.393396,48.06196
2023-320503,2023-05-26,000001,Vente,59570,,,KEREDEC,B035,29100,29226,Poullan-sur-Mer,29,,,29226000YB0006,,,,,,,,,,,,,0,,,,,T,terres,,,25824,-4.393396,48.06196
2023-320503,2023-05-26,000001,Vente,59570,,,KEREDEC,B035,29100,29226,Poullan-sur-Mer,29,,,29226000YB0045,,,,,,,,,,,,,0,,,,,T,terres,,,400,-4.394581,48.060162
2023-320503,2023-05-26,000001,Vente,59570,,,KEREDEC,B035,29100,29226,Poullan-sur-Mer,29,,,29226000YB0072,,,,,,,,,,,,,0,,,,,L,landes,,,320,-4.393288,48.060177
2023-320503,2023-05-26,000001,Vente,59570,,,BUZIINY,B008,29100,29226,Poullan-sur-Mer,29,,,29226000YB0074,,,,,,,,,,,,,0,,,,,T,terres,,,7360,-4.391522,48.06006
2023-320571,2023-05-19,000001,Vente,220000,14,,RTE AR GUERNEVEZ,0305,29100,29226,Poullan-sur-Mer,29,,,29226000ZI0280,,,,,,,,,,,,,0,,,,,S,sols,,,10,-4.412478,48.083453
2023-320571,2023-05-19,000001,Vente,220000,14,,RTE AR GUERNEVEZ,0305,29100,29226,Poullan-sur-Mer,29,,,29226000ZI0284,,,,,,,,,,,,,0,1,Maison,57,2,S,sols,,,392,-4.412697,48.083544
2023-320571,2023-05-19,000001,Vente,220000,14,,RTE AR GUERNEVEZ,0305,29100,29226,Poullan-sur-Mer,29,,,29226000ZI0298,,,,,,,,,,,,,0,,,,,S,sols,,,286,-4.412488,48.08356
2023-321167,2023-06-24,000001,Vente,7375.5,,,KERNAVENO,B072,29100,29226,Poullan-sur-Mer,29,,,29226000YE0174,,,,,,,,,,,,,0,,,,,T,terres,,,6705,-4.353609,48.066584
2023-321167,2023-06-24,000001,Vente,7375.5,,,KERNAVENO,B072,29100,29226,Poullan-sur-Mer,29,,,29226000YE0174,,,,,,,,,,,,,0,,,,,T,terres,,,6705,-4.353609,48.066584
2023-321175,2023-07-01,000001,Vente,30000,,,KERNAVENO,B072,29100,29226,Poullan-sur-Mer,29,,,29226000YE0175,,,,,,,,,,,,,0,,,,,S,sols,,,1574,-4.354906,48.064633
2023-321175,2023-07-01,000001,Vente,30000,,,KERNAVENO,B072,29100,29226,Poullan-sur-Mer,29,,,29226000YE0175,,,,,,,,,,,,,0,,,,,L,landes,,,9683,-4.354906,48.064633
2023-321176,2023-06-22,000001,Vente,7500,,,KERNAVENO,B072,29100,29226,Poullan-sur-Mer,29,,,29226000YE0029,,,,,,,,,,,,,0,,,,,P,prés,,,15020,-4.352313,48.067158
2023-321214,2023-06-14,000001,Vente,31000,,,QUILLOUARN,B114,29100,29226,Poullan-sur-Mer,29,,,29226000ZL0010,,,,,,,,,,,,,0,,,,,L,landes,,,12250,-4.374895,48.102632
2023-321226,2023-06-29,000001,Vente,135000,,,MESCOSQUER,B105,29100,29226,Poullan-sur-Mer,29,,,29226000ZN0060,,,,,,,,,,,,,0,,,,,S,sols,,,463,-4.417395,48.078354
2023-321226,2023-06-29,000001,Vente,135000,12,,RUE ALAIN TANGUY,0015,29100,29226,Poullan-sur-Mer,29,,,29226000ZN0357,,,,,,,,,,,,,0,1,Maison,160,4,S,sols,,,543,-4.417212,48.078389
2023-321226,2023-06-29,000001,Vente,135000,12,,RUE ALAIN TANGUY,0015,29100,29226,Poullan-sur-Mer,29,,,29226000ZN0357,,,,,,,,,,,,,0,3,Dépendance,,0,S,sols,,,543,-4.417212,48.078389
2023-321226,2023-06-29,000001,Vente,135000,,,RTE DE CONFORT,0130,29100,29226,Poullan-sur-Mer,29,,,29226000ZN0449,,,,,,,,,,,,,0,,,,,S,sols,,,800,-4.417602,48.078211
2023-321853,2023-07-07,000002,Vente,140000,,,PENDREFF,B111,29100,29226,Poullan-sur-Mer,29,,,29226000ZS0038,,,,,,,,,,,,,0,,,,,T,terres,,,25200,-4.384419,48.070873
2023-321853,2023-07-07,000002,Vente,140000,,,PENDREFF,B111,29100,29226,Poullan-sur-Mer,29,,,29226000ZS0039,,,,,,,,,,,,,0,,,,,T,terres,,,22715,-4.383392,48.07001
2023-321853,2023-07-07,000002,Vente,140000,,,PENDREFF,B111,29100,29226,Poullan-sur-Mer,29,,,29226000ZS0040,,,,,,,,,,,,,0,,,,,BF,futaies feuillues,,,22945,-4.381923,48.070737
2023-321853,2023-07-07,000002,Vente,140000,,,PENDREFF,B111,29100,29226,Poullan-sur-Mer,29,,,29226000ZS0041,,,,,,,,,,,,,0,,,,,L,landes,,,24535,-4.379759,48.070561
2023-321853,2023-07-07,000002,Vente,140000,,,PENDREFF,B111,29100,29226,Poullan-sur-Mer,29,,,29226000ZS0042,,,,,,,,,,,,,0,,,,,T,terres,,,17315,-4.378234,48.070966
2023-321853,2023-07-07,000002,Vente,140000,,,PENDREFF,B111,29100,29226,Poullan-sur-Mer,29,,,29226000ZS0044,,,,,,,,,,,,,0,,,,,T,terres,,,9745,-4.37926,48.072562
2023-321853,2023-07-07,000002,Vente,140000,,,PENDREFF,B111,29100,29226,Poullan-sur-Mer,29,,,29226000ZS0045,,,,,,,,,,,,,0,,,,,T,terres,,,20915,-4.380232,48.071864
2023-321853,2023-07-07,000002,Vente,140000,,,PENDREFF,B111,29100,29226,Poullan-sur-Mer,29,,,29226000ZS0046,,,,,,,,,,,,,0,,,,,T,terres,,,15650,-4.381652,48.071625
2023-321853,2023-07-07,000002,Vente,140000,,,PENDREFF,B111,29100,29226,Poullan-sur-Mer,29,,,29226000ZS0047,,,,,,,,,,,,,0,,,,,T,terres,,,34870,-4.382977,48.07288
2023-321853,2023-07-07,000002,Vente,140000,,,PENDREFF,B111,29100,29226,Poullan-sur-Mer,29,,,29226000ZS0049,,,,,,,,,,,,,0,,,,,T,terres,,,18566,-4.380229,48.073904
2023-321853,2023-07-07,000002,Vente,140000,,,PENDREFF,B111,29100,29226,Poullan-sur-Mer,29,,,29226000ZS0121,,,,,,,,,,,,,0,,,,,P,prés,,,30008,-4.377534,48.071588
2023-322017,2023-07-20,000002,Vente,63000,,,LESCONIL,B094,29100,29226,Poullan-sur-Mer,29,,,29226000ZM0031,,,,,,,,,,,,,0,,,,,T,terres,,,1120,-4.377788,48.091194
2023-322017,2023-07-20,000002,Vente,63000,,,LESCONIL,B094,29100,29226,Poullan-sur-Mer,29,,,29226000ZM0296,,,,,,,,,,,,,0,,,,,S,sols,,,2816,,
2023-322503,2023-08-03,000001,Vente,28435,,,MESCOSQUER,B105,29100,29226,Poullan-sur-Mer,29,,,29226000ZN0583,,,,,,,,,,,,,0,,,,,AB,terrains a bâtir,,,517,-4.416109,48.077112
2023-323121,2023-08-29,000001,Vente,26400,,,MESCOSQUER,B105,29100,29226,Poullan-sur-Mer,29,,,29226000ZN0511,,,,,,,,,,,,,0,,,,,AB,terrains a bâtir,,,480,-4.414825,48.077596
2023-323122,2023-08-24,000001,Vente,38555,,,MESCOSQUER,B105,29100,29226,Poullan-sur-Mer,29,,,29226000ZN0509,,,,,,,,,,,,,0,,,,,AB,terrains a bâtir,,,701,-4.415089,48.077281
2023-323123,2023-08-22,000001,Vente,30525,,,MESCOSQUER,B105,29100,29226,Poullan-sur-Mer,29,,,29226000ZN0582,,,,,,,,,,,,,0,,,,,AB,terrains a bâtir,,,555,-4.416387,48.077034
2023-323235,2023-08-24,000001,Vente,271492,2005,,LESCONIL,B094,29100,29226,Poullan-sur-Mer,29,,,29226000ZM0113,,,,,,,,,,,,,0,1,Maison,115,5,S,sols,,,112,-4.372272,48.092115
2023-323235,2023-08-24,000001,Vente,271492,2005,,LESCONIL,B094,29100,29226,Poullan-sur-Mer,29,,,29226000ZM0113,,,,,,,,,,,,,0,1,Maison,115,5,L,landes,,,1000,-4.372272,48.092115
2023-323235,2023-08-24,000001,Vente,271492,2005,,LESCONIL,B094,29100,29226,Poullan-sur-Mer,29,,,29226000ZM0113,,,,,,,,,,,,,0,1,Maison,115,5,L,landes,,,2188,-4.372272,48.092115
2023-323235,2023-08-24,000001,Vente,271492,2005,,LESCONIL,B094,29100,29226,Poullan-sur-Mer,29,,,29226000ZM0113,,,,,,,,,,,,,0,1,Maison,115,5,P,prés,,,1700,-4.372272,48.092115
2023-323989,2023-09-26,000001,Vente,49107,5018,,COAT GUILER,B011,29100,29226,Poullan-sur-Mer,29,,,29226000ZX0052,,,,,,,,,,,,,0,3,Dépendance,,0,S,sols,,,220,-4.365697,48.056758
2023-323989,2023-09-26,000001,Vente,49107,5018,,COAT GUILER,B011,29100,29226,Poullan-sur-Mer,29,,,29226000ZX0052,,,,,,,,,,,,,0,3,Dépendance,,0,J,jardins,,,1000,-4.365697,48.056758
2023-323989,2023-09-26,000001,Vente,49107,,,COAT GUILER,B011,29100,29226,Poullan-sur-Mer,29,,,29226000ZX0124,,,,,,,,,,,,,0,,,,,S,sols,,,120,-4.365612,48.056554
2023-324028,2023-09-26,000001,Vente,616000,,,KERGAVAN,B048,29100,29226,Poullan-sur-Mer,29,,,29226000ZL0175,,,,,,,,,,,,,0,,,,,T,terres,,,60,-4.380324,48.103373
2023-324028,2023-09-26,000001,Vente,616000,5024,,KERGAVAN,B048,29100,29226,Poullan-sur-Mer,29,,,29226000ZL0176,,,,,,,,,,,,,0,1,Maison,171,4,S,sols,,,679,-4.380061,48.103778
2023-324028,2023-09-26,000001,Vente,616000,5024,,KERGAVAN,B048,29100,29226,Poullan-sur-Mer,29,,,29226000ZL0176,,,,,,,,,,,,,0,1,Maison,171,4,J,jardins,,,1000,-4.380061,48.103778
2023-324028,2023-09-26,000001,Vente,616000,,,KERGAVAN,B048,29100,29226,Poullan-sur-Mer,29,,,29226000ZL0178,,,,,,,,,,,,,0,,,,,S,sols,,,261,-4.380189,48.103375
2023-324183,2023-09-08,000001,Vente,39160,,,MESCOSQUER,B105,29100,29226,Poullan-sur-Mer,29,,,29226000ZN0483,,,,,,,,,,,,,0,,,,,AB,terrains a bâtir,,,657,-4.416682,48.076979
2023-324183,2023-09-08,000001,Vente,39160,,,MESCOSQUER,B105,29100,29226,Poullan-sur-Mer,29,,,29226000ZN0587,,,,,,,,,,,,,0,,,,,AB,terrains a bâtir,,,55,-4.416807,48.076995
2023-324217,2023-10-06,000001,Vente,230000,4,,IMP DES ALOUETTES,0020,29100,29226,Poullan-sur-Mer,29,,,29226000YD0098,,,,,,,,,,,,,0,1,Maison,115,5,S,sols,,,580,-4.36956,48.083455
2023-324407,2023-09-30,000002,Vente,315000,,,KERGAVAN,B048,29100,29226,Poullan-sur-Mer,29,,,29226000ZL0179,,,,,,,,,,,,,0,,,,,S,sols,,,77,-4.380307,48.103282
2023-324407,2023-09-30,000002,Vente,315000,,,KERGAVAN,B048,29100,29226,Poullan-sur-Mer,29,,,29226000ZL0220,,,,,,,,,,,,,0,,,,,S,sols,,,184,-4.380112,48.103151
2023-324407,2023-09-30,000002,Vente,315000,,,KERGAVAN,B048,29100,29226,Poullan-sur-Mer,29,,,29226000ZL0224,,,,,,,,,,,,,0,,,,,T,terres,,,65,-4.380321,48.103166
2023-324407,2023-09-30,000002,Vente,315000,,,KERGAVAN,B048,29100,29226,Poullan-sur-Mer,29,,,29226000ZL0226,,,,,,,,,,,,,0,,,,,S,sols,,,42,-4.38015,48.103199
2023-324407,2023-09-30,000002,Vente,315000,94,,KERGAVAN,B048,29100,29226,Poullan-sur-Mer,29,,,29226000ZL0228,,,,,,,,,,,,,0,1,Maison,118,4,S,sols,,,378,-4.380337,48.103095
2023-324407,2023-09-30,000002,Vente,315000,,,KERGAVAN,B048,29100,29226,Poullan-sur-Mer,29,,,29226000ZL0236,,,,,,,,,,,,,0,,,,,T,terres,,,123,-4.380346,48.103241
2023-324407,2023-09-30,000002,Vente,315000,,,KERGAVAN,B048,29100,29226,Poullan-sur-Mer,29,,,29226000ZL0249,,,,,,,,,,,,,0,,,,,S,sols,,,71,-4.380088,48.103029
2023-324407,2023-09-30,000002,Vente,315000,,,KERGAVAN,B048,29100,29226,Poullan-sur-Mer,29,,,29226000ZL0310,,,,,,,,,,,,,0,,,,,S,sols,,,45,-4.379996,48.103023
2023-324407,2023-09-30,000002,Vente,315000,,,KERGAVAN,B048,29100,29226,Poullan-sur-Mer,29,,,29226000ZL0312,,,,,,,,,,,,,0,,,,,S,sols,,,5,-4.380023,48.102979
2023-324407,2023-09-30,000002,Vente,315000,,,KERGAVAN,B048,29100,29226,Poullan-sur-Mer,29,,,29226000ZL0326,,,,,,,,,,,,,0,,,,,T,terres,,,177,,
2023-324669,2023-10-17,000001,Vente,275414,115,A,LESTRIVIN,B096,29100,29226,Poullan-sur-Mer,29,,,29226000ZM0109,,,,,,,,,,,,,0,1,Maison,116,5,S,sols,,,760,-4.381468,48.088415
2023-324669,2023-10-17,000001,Vente,275414,115,A,LESTRIVIN,B096,29100,29226,Poullan-sur-Mer,29,,,29226000ZM0109,,,,,,,,,,,,,0,1,Maison,116,5,J,jardins,,,1200,-4.381468,48.088415
2023-324689,2023-10-14,000001,Vente,35970,,,MESCOSQUER,B105,29100,29226,Poullan-sur-Mer,29,,,29226000ZN0480,,,,,,,,,,,,,0,,,,,AB,terrains a bâtir,,,654,-4.417603,48.076911
2023-324829,2023-10-20,000002,Vente,2500,,,LE BOURG,B004,29100,29226,Poullan-sur-Mer,29,,,29226000YC0513,,,,,,,,,,,,,0,,,,,T,terres,,,209,-4.418066,48.080052
2023-325437,2023-11-16,000001,Vente,4000,,,LESCONIL,B094,29100,29226,Poullan-sur-Mer,29,,,29226000ZM0182,,,,,,,,,,,,,0,,,,,P,prés,,,1248,-4.372739,48.090971
2023-325437,2023-11-16,000001,Vente,4000,,,LESCONIL,B094,29100,29226,Poullan-sur-Mer,29,,,29226000ZM0182,,,,,,,,,,,,,0,,,,,L,landes,,,3700,-4.372739,48.090971
2023-325437,2023-11-16,000001,Vente,4000,,,LESCONIL,B094,29100,29226,Poullan-sur-Mer,29,,,29226000ZM0182,,,,,,,,,,,,,0,,,,,L,landes,,,2769,-4.372739,48.090971
2023-326022,2023-12-05,000001,Vente,9636.4,,,KERNAVENO,B072,29100,29226,Poullan-sur-Mer,29,,,29226000YE0046,,,,,,,,,,,,,0,,,,,T,terres,,,2710,-4.354922,48.066072
2023-326022,2023-12-05,000001,Vente,9636.4,,,KERNAVENO,B072,29100,29226,Poullan-sur-Mer,29,,,29226000YE0101,,,,,,,,,,,,,0,,,,,S,sols,,,250,-4.354578,48.065777
2023-326022,2023-12-05,000001,Vente,9636.4,,,KERNAVENO,B072,29100,29226,Poullan-sur-Mer,29,,,29226000YE0186,,,,,,,,,,,,,0,,,,,L,landes,,,448,-4.355191,48.065765
2023-326022,2023-12-05,000001,Vente,9636.4,,,KERNAVENO,B072,29100,29226,Poullan-sur-Mer,29,,,29226000YE0188,,,,,,,,,,,,,0,,,,,L,landes,,,21149,-4.355921,48.06495
2023-326026,2023-12-06,000002,Vente,22000,,,LE BOURG,B004,29100,29226,Poullan-sur-Mer,29,,,29226000YC0518,,,,,,,,,,,,,0,,,,,S,sols,,,60,-4.412695,48.081999
2023-326056,2023-12-01,000001,Vente,150000,,,MEILH KERDUNIG,B109,29100,29226,Poullan-sur-Mer,29,,,29226000ZT0013,,,,,,,,,,,,,0,,,,,T,terres,,,1440,-4.37182,48.064469
2023-326056,2023-12-01,000001,Vente,150000,,,MEILH KERDUNIG,B109,29100,29226,Poullan-sur-Mer,29,,,29226000ZT0014,,,,,,,,,,,,,0,,,,,P,prés,,,7340,-4.371485,48.064874
2023-326056,2023-12-01,000001,Vente,150000,,,MEILH KERDUNIG,B109,29100,29226,Poullan-sur-Mer,29,,,29226000ZT0014,,,,,,,,,,,,,0,,,,,P,prés,,,930,-4.371485,48.064874
2023-326056,2023-12-01,000001,Vente,150000,,,MEILH KERDUNIG,B109,29100,29226,Poullan-sur-Mer,29,,,29226000ZT0014,,,,,,,,,,,,,0,,,,,T,terres,,,340,-4.371485,48.064874
2023-326056,2023-12-01,000001,Vente,150000,539,,MEILH KERDUNIG,B109,29100,29226,Poullan-sur-Mer,29,,,29226000ZT0090,,,,,,,,,,,,,0,3,Dépendance,,0,S,sols,,,775,-4.370631,48.064839
2023-326056,2023-12-01,000001,Vente,150000,539,,MEILH KERDUNIG,B109,29100,29226,Poullan-sur-Mer,29,,,29226000ZT0090,,,,,,,,,,,,,0,1,Maison,140,5,S,sols,,,775,-4.370631,48.064839
2023-326056,2023-12-01,000001,Vente,150000,,,MEILH KERDUNIG,B109,29100,29226,Poullan-sur-Mer,29,,,29226000ZT0091,,,,,,,,,,,,,0,,,,,T,terres,,,250,-4.371111,48.064628
2023-326056,2023-12-01,000001,Vente,150000,,,MEILH KERDUNIG,B109,29100,29226,Poullan-sur-Mer,29,,,29226000ZT0111,,,,,,,,,,,,,0,,,,,E,eaux,,,350,-4.370912,48.064717
2023-326056,2023-12-01,000001,Vente,150000,,,KERVEOC,B081,29100,29226,Poullan-sur-Mer,29,,,29226000ZT0140,,,,,,,,,,,,,0,,,,,P,prés,,,759,-4.370147,48.064703