id_mutation,date_mutation,numero_disposition,nature_mutation,valeur_fonciere,adresse_numero,adresse_suffixe,adresse_nom_voie,adresse_code_voie,code_postal,code_commune,nom_commune,code_departement,ancien_code_commune,ancien_nom_commune,id_parcelle,ancien_id_parcelle,numero_volume,lot1_numero,lot1_surface_carrez,lot2_numero,lot2_surface_carrez,lot3_numero,lot3_surface_carrez,lot4_numero,lot4_surface_carrez,lot5_numero,lot5_surface_carrez,nombre_lots,code_type_local,type_local,surface_reelle_bati,nombre_pieces_principales,code_nature_culture,nature_culture,code_nature_culture_speciale,nature_culture_speciale,surface_terrain,longitude,latitude
2023-343230,2023-01-09,000001,Vente,170000,,,TEPPA,B531,20214,2B049,Calenzana,2B,,,2B0490000J0881,,,,,,,,,,,,,0,,,,,AB,terrains a bâtir,,,1000,8.858827,42.515645
2023-343277,2023-01-19,000001,Vente,410000,1360,,ASTRO,B009,20214,2B049,Calenzana,2B,,,2B0490000F1360,,,,,,,,,,,,,0,1,Maison,92,3,S,sols,,,870,8.811118,42.529364
2023-343277,2023-01-19,000001,Vente,410000,1360,,ASTRO,B009,20214,2B049,Calenzana,2B,,,2B0490000F1360,,,,,,,,,,,,,0,3,Dépendance,,0,S,sols,,,870,8.811118,42.529364
2023-343286,2023-01-20,000001,Vente,160000,5205,,PIOVANACCIO,B076,20214,2B049,Calenzana,2B,,,2B049000AC0228,,,,,,,,,,,,,0,1,Maison,66,4,S,sols,,,64,8.856779,42.507313
2023-343286,2023-01-20,000001,Vente,160000,,,PIOVANACCIO,B076,20214,2B049,Calenzana,2B,,,2B049000AC0264,,,,,,,,,,,,,0,,,,,S,sols,,,24,8.856724,42.507471
2023-343286,2023-01-20,000001,Vente,160000,,,PIOVANACCIO,B076,20214,2B049,Calenzana,2B,,,2B049000AC0264,,,,,,,,,,,,,0,,,,,J,jardins,,,128,8.856724,42.507471
2023-343329,2023-01-19,000001,Vente,341500,893,,PIETRA GEMINA,B546,20214,2B049,Calenzana,2B,,,2B0490000J0893,,,,,,,,,,,,,0,1,Maison,84,3,S,sols,,,492,8.857495,42.511739
2023-343334,2023-01-24,000002,Vente,8000,,,ASTRO,B009,20214,2B049,Calenzana,2B,,,2B0490000B0366,,,,,,,,,,,,,0,,,,,L,landes,FRICH,Friche,32480,8.705302,42.468695
2023-343334,2023-01-24,000002,Vente,8000,,,TRIMOZOLU,B202,20214,2B049,Calenzana,2B,,,2B0490000B0612,,,,,,,,,,,,,0,,,,,L,landes,FRICH,Friche,8258,8.705576,42.477997
2023-343584,2023-02-16,000001,Vente,455000,,,VACCHAJA,B204,20214,2B049,Calenzana,2B,,,2B0490000J0969,,,,,,,,,,,,,0,,,,,AB,terrains a bâtir,,,474,8.856841,42.514591
2023-343600,2023-01-30,000001,Vente,280000,5822,,FUSETI,B598,20214,2B049,Calenzana,2B,,,2B0490000K0295,,,,,,,,,,,,,0,1,Maison,120,5,S,sols,,,1000,8.865307,42.513394
2023-343673,2023-01-30,000001,Vente,115000,,,POGGIALE,B530,20214,2B049,Calenzana,2B,,,2B0490000J0932,,,,,,,,,,,,,0,,,,,AB,terrains a bâtir,,,524,8.854225,42.513933
2023-343673,2023-01-30,000001,Vente,115000,,,POGGIALE,B530,20214,2B049,Calenzana,2B,,,2B0490000J0934,,,,,,,,,,,,,0,,,,,AB,terrains a bâtir,,,508,8.85473,42.514268
2023-343673,2023-01-30,000001,Vente,115000,,,POGGIALE,B530,20214,2B049,Calenzana,2B,,,2B0490000J0946,,,,,,,,,,,,,0,,,,,AB,terrains a bâtir,,,1652,8.854999,42.513698
2023-343673,2023-01-30,000001,Vente,115000,,,POGGIALE,B530,20214,2B049,Calenzana,2B,,,2B0490000J0947,,,,,,,,,,,,,0,,,,,AB,terrains a bâtir,,,854,8.8554,42.514009
2023-343673,2023-01-30,000001,Vente,115000,,,POGGIALE,B530,20214,2B049,Calenzana,2B,,,2B0490000J0949,,,,,,,,,,,,,0,,,,,AB,terrains a bâtir,,,14,8.855459,42.513134
2023-343724,2023-02-16,000001,Vente,330000,,,VACCHAJA,B204,20214,2B049,Calenzana,2B,,,2B0490000J0972,,,,,,,,,,,,,0,,,,,AB,terrains a bâtir,,,432,8.856417,42.514481
2023-343730,2023-02-27,000001,Vente,70000,5280,,PLACE COMMUNE,B077,20214,2B049,Calenzana,2B,,,2B049000AB0418,,,7,,8,,,,,,,,2,2,Appartement,81,3,,,,,,8.856022,42.506842
2023-343801,2023-02-15,000001,Vente,276500,5001,,POGGIALE,B530,20214,2B049,Calenzana,2B,,,2B0490000J0920,,,61,,,,,,,,,,1,3,Dépendance,,0,,,,,,8.856189,42.515336
2023-343801,2023-02-15,000001,Vente,276500,5001,,POGGIALE,B530,20214,2B049,Calenzana,2B,,,2B0490000J0920,,,15,65.54,,,,,,,,,1,2,Appartement,65,3,,,,,,8.856189,42.515336
2023-343835,2023-02-07,000001,Vente,440000,29,,PIETRALBA,B072,20214,2B049,Calenzana,2B,,,2B0490000F0955,,,,,,,,,,,,,0,1,Maison,135,5,S,sols,,,580,8.826213,42.531169
2023-343837,2023-02-08,000001,Vente,50000,5069,,FONDO,B044,20214,2B049,Calenzana,2B,,,2B049000AB0059,,,3,,,,,,,,,,1,2,Appartement,17,1,,,,,,8.853331,42.507439
2023-343837,2023-02-08,000001,Vente,50000,5069,,FONDO,B044,20214,2B049,Calenzana,2B,,,2B049000AB0059,,,3,,,,,,,,,,1,3,Dépendance,,0,,,,,,8.853331,42.507439
2023-343853,2023-02-23,000001,Vente,181500,735,,PIOBBO,B545,20214,2B049,Calenzana,2B,,,2B0490000K0735,,,2,57.35,,,,,,,,,1,2,Appartement,45,2,,,,,,8.860699,42.513649
2023-343856,2023-03-03,000001,Vente,4000,,,CARUGLIOLO,B029,20214,2B049,Calenzana,2B,,,2B049000AB0474,,,,,,,,,,,,,0,,,,,J,jardins,,,55,8.855922,42.506268
2023-343874,2023-03-01,000001,Vente,72000,5015,,LES AMANDIERS,B111,20214,2B049,Calenzana,2B,,,2B049000AC0152,,,223,,,,,,,,,,1,3,Dépendance,,0,,,,,,8.860168,42.506395
2023-343874,2023-03-01,000001,Vente,72000,5015,,LES AMANDIERS,B111,20214,2B049,Calenzana,2B,,,2B049000AC0152,,,174,24.6,,,,,,,,,1,2,Appartement,40,2,,,,,,8.860168,42.506395
2023-343874,2023-03-01,000001,Vente,72000,5015,,LES AMANDIERS,B111,20214,2B049,Calenzana,2B,,,2B049000AC0152,,,225,,,,,,,,,,1,3,Dépendance,,0,,,,,,8.860168,42.506395
2023-343874,2023-03-01,000001,Vente,72000,5015,,LES AMANDIERS,B111,20214,2B049,Calenzana,2B,,,2B049000AC0152,,,176,40,,,,,,,,,1,2,Appartement,42,2,,,,,,8.860168,42.506395
2023-344011,2023-03-16,000001,Vente,243300,5451,,LA FRUSTA,B054,20214,2B049,Calenzana,2B,,,2B049000AB0098,,,,,,,,,,,,,0,1,Maison,60,3,S,sols,,,72,8.853782,42.507102
2023-344016,2023-03-16,000001,Vente,130860,5015,,LES AMANDIERS,B111,20214,2B049,Calenzana,2B,,,2B049000AC0152,,,233,,,,,,,,,,1,3,Dépendance,,0,,,,,,8.860168,42.506395
2023-344016,2023-03-16,000001,Vente,130860,5015,,LES AMANDIERS,B111,20214,2B049,Calenzana,2B,,,2B049000AC0152,,,184,52.05,,,,,,,,,1,2,Appartement,30,1,,,,,,8.860168,42.506395
2023-344103,2023-03-24,000002,Echange,8400,,,CHIOSELLO,B033,20214,2B049,Calenzana,2B,,,2B049000AB0895,,,,,,,,,,,,,0,,,,,T,terres,,,42,8.853601,42.508182
2023-344252,2023-03-22,000001,Vente,332710,5980,,PIETRALBA,B072,20214,2B049,Calenzana,2B,,,2B0490000F0943,,,,,,,,,,,,,0,1,Maison,70,3,S,sols,,,782,8.825365,42.53047
2023-344256,2023-03-27,000001,Vente,250000,,,MEZZANODE,B063,20214,2B049,Calenzana,2B,,,2B0490000E0739,,,,,,,,,,,,,0,,,,,L,landes,FRICH,Friche,320,8.794945,42.500779
2023-344256,2023-03-27,000001,Vente,250000,,,LA PARATELLA,B329,20214,2B049,Calenzana,2B,,,2B0490000E0740,,,,,,,,,,,,,0,,,,,L,landes,FRICH,Friche,212,8.794129,42.500684
2023-344256,2023-03-27,000001,Vente,250000,5955,,MEZZANODE,B063,20214,2B049,Calenzana,2B,,,2B0490000E0828,,,,,,,,,,,,,0,1,Maison,119,7,T,terres,,,420,8.795673,42.501283
2023-344256,2023-03-27,000001,Vente,250000,5955,,MEZZANODE,B063,20214,2B049,Calenzana,2B,,,2B0490000E0828,,,,,,,,,,,,,0,1,Maison,119,7,S,sols,,,1500,8.795673,42.501283
2023-344281,2023-04-05,000001,Vente,150000,5501,,COLLU A CHIESA,B259,20214,2B049,Calenzana,2B,,,2B0490000D0205,,,4,42.27,,,,,,,,,1,2,Appartement,43,2,,,,,,8.73639,42.459403
2023-344352,2023-03-27,000001,Vente,123700,,,POGGIALE,B530,20214,2B049,Calenzana,2B,,,2B0490000J0931,,,,,,,,,,,,,0,,,,,AB,terrains a bâtir,,,570,8.854245,42.513697
2023-344352,2023-03-27,000001,Vente,123700,,,POGGIALE,B530,20214,2B049,Calenzana,2B,,,2B0490000J0932,,,,,,,,,,,,,0,,,,,AB,terrains a bâtir,,,524,8.854225,42.513933
2023-344352,2023-03-27,000001,Vente,123700,,,POGGIALE,B530,20214,2B049,Calenzana,2B,,,2B0490000J0946,,,,,,,,,,,,,0,,,,,AB,terrains a bâtir,,,1652,8.854999,42.513698
2023-344352,2023-03-27,000001,Vente,123700,,,POGGIALE,B530,20214,2B049,Calenzana,2B,,,2B0490000J0947,,,,,,,,,,,,,0,,,,,AB,terrains a bâtir,,,854,8.8554,42.514009
2023-344352,2023-03-27,000001,Vente,123700,,,POGGIALE,B530,20214,2B049,Calenzana,2B,,,2B0490000J0949,,,,,,,,,,,,,0,,,,,AB,terrains a bâtir,,,14,8.855459,42.513134
2023-344379,2023-04-07,000001,Vente,500000,,,CASACURIA,B541,20214,2B049,Calenzana,2B,,,2B0490000J0297,,,,,,,,,,,,,0,,,,,T,terres,,,11350,,
2023-344379,2023-04-07,000001,Vente,500000,,,CASACURIA,B541,20214,2B049,Calenzana,2B,,,2B0490000J0321,,,,,,,,,,,,,0,,,,,J,jardins,,,540,8.860911,42.50606
2023-344498,2023-04-06,000001,Vente,105000,5015,,LES AMANDIERS,B111,20214,2B049,Calenzana,2B,,,2B049000AC0152,,,58,,,,,,,,,,1,2,Appartement,43,2,,,,,,8.860168,42.506395
2023-344511,2023-04-19,000001,Vente,20000,379,,RES FABIANI,A702,20214,2B049,Calenzana,2B,,,2B049000AC0378,,,5,,,,,,,,,,1,3,Dépendance,,0,,,,,,8.856751,42.507845
2023-344571,2023-04-06,000001,Vente,12000,5178,,VESCO,B100,20214,2B049,Calenzana,2B,,,2B049000AB0324,,,,,,,,,,,,,0,3,Dépendance,,0,S,sols,,,62,8.855848,42.50713
2023-344571,2023-04-06,000001,Vente,12000,5178,,VESCO,B100,20214,2B049,Calenzana,2B,,,2B049000AB0324,,,,,,,,,,,,,0,3,Dépendance,,0,S,sols,,,62,8.855848,42.50713
2023-344671,2023-04-28,000001,Vente,445000,,,PINZALI,B074,20214,2B049,Calenzana,2B,,,2B0490000F1593,,,,,,,,,,,,,0,,,,,VI,vignes,,,75,8.830206,42.528912
2023-344671,2023-04-28,000001,Vente,445000,,,PINZALI,B074,20214,2B049,Calenzana,2B,,,2B0490000F1594,,,,,,,,,,,,,0,,,,,VI,vignes,,,73,8.830229,42.529015
2023-344671,2023-04-28,000001,Vente,445000,5000,,PINZALI,B074,20214,2B049,Calenzana,2B,,,2B0490000F1595,,,,,,,,,,,,,0,1,Maison,108,4,VI,vignes,,,474,8.830369,42.529006
2023-344671,2023-04-28,000001,Vente,445000,,,PIETRALBA,B072,20214,2B049,Calenzana,2B,,,2B0490000F1708,,,,,,,,,,,,,0,,,,,AB,terrains a bâtir,,,548,8.829946,42.530381
2023-344671,2023-04-28,000001,Vente,445000,,,PIETRALBA,B072,20214,2B049,Calenzana,2B,,,2B0490000F1711,,,,,,,,,,,,,0,,,,,AB,terrains a bâtir,,,534,8.829532,42.530016
2023-344671,2023-04-28,000001,Vente,445000,,,PIETRALBA,B072,20214,2B049,Calenzana,2B,,,2B0490000F1717,,,,,,,,,,,,,0,,,,,AB,terrains a bâtir,,,14,8.829073,42.530037
2023-344671,2023-04-28,000001,Vente,445000,,,PIETRALBA,B072,20214,2B049,Calenzana,2B,,,2B0490000F1718,,,,,,,,,,,,,0,,,,,AB,terrains a bâtir,,,1,8.829077,42.530056
2023-344671,2023-04-28,000001,Vente,445000,,,PIETRALBA,B072,20214,2B049,Calenzana,2B,,,2B0490000F1726,,,,,,,,,,,,,0,,,,,AB,terrains a bâtir,,,820,8.829841,42.529189
2023-344671,2023-04-28,000001,Vente,445000,,,PIETRALBA,B072,20214,2B049,Calenzana,2B,,,2B0490000F1739,,,,,,,,,,,,,0,,,,,AB,terrains a bâtir,,,121,8.830515,42.529472
2023-344671,2023-04-28,000001,Vente,445000,,,PIETRALBA,B072,20214,2B049,Calenzana,2B,,,2B0490000F1741,,,,,,,,,,,,,0,,,,,AB,terrains a bâtir,,,209,8.830429,42.529207
2023-344671,2023-04-28,000001,Vente,445000,,,PIETRALBA,B072,20214,2B049,Calenzana,2B,,,2B0490000F1742,,,,,,,,,,,,,0,,,,,AB,terrains a bâtir,,,21,8.830565,42.529322
2023-344682,2023-04-27,000001,Vente,92000,5094,,CHIASSO LONGO,B032,20214,2B049,Calenzana,2B,,,2B049000AB0228,,,,,,,,,,,,,0,1,Maison,48,3,S,sols,,,15,8.854072,42.507583
2023-344708,2023-04-27,000001,Vente,125000,,,ASTRO,B009,20214,2B049,Calenzana,2B,,,2B0490000F1678,,,,,,,,,,,,,0,,,,,L,landes,FRICH,Friche,221,8.812604,42.53077
2023-344708,2023-04-27,000001,Vente,125000,,,ASTRO,B009,20214,2B049,Calenzana,2B,,,2B0490000F1681,,,,,,,,,,,,,0,,,,,AB,terrains a bâtir,,,565,8.812476,42.530606
2023-344708,2023-04-27,000001,Vente,125000,,,ASTRO,B009,20214,2B049,Calenzana,2B,,,2B0490000F1688,,,,,,,,,,,,,0,,,,,L,landes,FRICH,Friche,572,8.813466,42.530612
2023-344716,2023-04-25,000001,Vente,1475000,5087,,FONDO,B044,20214,2B049,Calenzana,2B,,,2B049000AB0038,,,,,,,,,,,,,0,3,Dépendance,,0,S,sols,,,1020,8.853728,42.507912
2023-344716,2023-04-25,000001,Vente,1475000,5087,,FONDO,B044,20214,2B049,Calenzana,2B,,,2B049000AB0038,,,,,,,,,,,,,0,2,Appartement,270,6,S,sols,,,1020,8.853728,42.507912
2023-344716,2023-04-25,000001,Vente,1475000,5087,,FONDO,B044,20214,2B049,Calenzana,2B,,,2B049000AB0038,,,,,,,,,,,,,0,4,Local industriel. commercial ou assimilé,132,0,S,sols,,,1020,8.853728,42.507912
2023-344716,2023-04-25,000001,Vente,1475000,5087,,FONDO,B044,20214,2B049,Calenzana,2B,,,2B049000AB0038,,,,,,,,,,,,,0,2,Appartement,58,3,S,sols,,,1020,8.853728,42.507912
2023-344716,2023-04-25,000001,Vente,1475000,5087,,FONDO,B044,20214,2B049,Calenzana,2B,,,2B049000AB0038,,,,,,,,,,,,,0,3,Dépendance,,0,S,sols,,,1020,8.853728,42.507912
2023-344716,2023-04-25,000001,Vente,1475000,5086,,FONDO,B044,20214,2B049,Calenzana,2B,,,2B049000AB0039,,,,,,,,,,,,,0,3,Dépendance,,0,S,sols,,,210,8.853459,42.508059
2023-344716,2023-04-25,000001,Vente,1475000,,,CHIOSELLO,B033,20214,2B049,Calenzana,2B,,,2B049000AB0896,,,,,,,,,,,,,0,,,,,T,terres,,,295,8.853705,42.508117
2023-344799,2023-04-27,000001,Vente,675000,6047,,SAINT IGNACE,B090,20214,2B049,Calenzana,2B,,,2B049000AC0137,,,,,,,,,,,,,0,1,Maison,160,7,S,sols,,,1525,8.860424,42.507648
2023-344799,2023-04-27,000001,Vente,675000,5417,A,PAGLIAJO,B110,20214,2B049,Calenzana,2B,,,2B0490000J0606,,,,,,,,,,,,,0,1,Maison,136,4,S,sols,,,1000,8.860804,42.507336
2023-344799,2023-04-27,000001,Vente,675000,5417,A,PAGLIAJO,B110,20214,2B049,Calenzana,2B,,,2B0490000J0606,,,,,,,,,,,,,0,3,Dépendance,,0,S,sols,,,1000,8.860804,42.507336
2023-344799,2023-04-27,000001,Vente,675000,5417,A,PAGLIAJO,B110,20214,2B049,Calenzana,2B,,,2B0490000J0606,,,,,,,,,,,,,0,1,Maison,136,4,T,terres,,,1120,8.860804,42.507336
2023-344799,2023-04-27,000001,Vente,675000,5417,A,PAGLIAJO,B110,20214,2B049,Calenzana,2B,,,2B0490000J0606,,,,,,,,,,,,,0,3,Dépendance,,0,T,terres,,,1120,8.860804,42.507336
2023-344868,2023-05-12,000001,Vente,80000,,,SANTA RESTITUDA,B715,20214,2B049,Calenzana,2B,,,2B0490000K0062,,,,,,,,,,,,,0,,,,,AB,terrains a bâtir,,,600,8.869911,42.511605
2023-344893,2023-05-17,000001,Vente,100000,5389,,BIANCOLACCIO,B010,20214,2B049,Calenzana,2B,,,2B049000AB0182,,,,,,,,,,,,,0,1,Maison,80,4,S,sols,,,72,8.854823,42.506835
2023-344950,2023-05-19,000001,Vente en l'état futur d'achèvement,3000,5001,,POGGIALE,B530,20214,2B049,Calenzana,2B,,,2B0490000J0920,,,85,,,,,,,,,,1,3,Dépendance,,0,,,,,,8.856189,42.515336
2023-345137,2023-05-31,000001,Vente,325000,,,PLACE DE L EGLISE,B078,20214,2B049,Calenzana,2B,,,2B049000AB0278,,,,,,,,,,,,,0,,,,,J,jardins,,,175,8.854808,42.50754
2023-345137,2023-05-31,000001,Vente,325000,5149,,CALELLO,B013,20214,2B049,Calenzana,2B,,,2B049000AB0280,,,,,,,,,,,,,0,1,Maison,26,1,S,sols,,,300,8.854869,42.50738
2023-345137,2023-05-31,000001,Vente,325000,5149,,CALELLO,B013,20214,2B049,Calenzana,2B,,,2B049000AB0280,,,,,,,,,,,,,0,3,Dépendance,,0,S,sols,,,300,8.854869,42.50738
2023-345137,2023-05-31,000001,Vente,325000,5149,,CALELLO,B013,20214,2B049,Calenzana,2B,,,2B049000AB0280,,,,,,,,,,,,,0,3,Dépendance,,0,S,sols,,,300,8.854869,42.50738
2023-345137,2023-05-31,000001,Vente,325000,5149,,CALELLO,B013,20214,2B049,Calenzana,2B,,,2B049000AB0280,,,,,,,,,,,,,0,2,Appartement,40,2,S,sols,,,300,8.854869,42.50738
2023-345137,2023-05-31,000001,Vente,325000,5149,,CALELLO,B013,20214,2B049,Calenzana,2B,,,2B049000AB0280,,,,,,,,,,,,,0,2,Appartement,72,4,S,sols,,,300,8.854869,42.50738
2023-345137,2023-05-31,000001,Vente,325000,5149,,CALELLO,B013,20214,2B049,Calenzana,2B,,,2B049000AB0280,,,,,,,,,,,,,0,4,Local industriel. commercial ou assimilé,25,0,S,sols,,,300,8.854869,42.50738
2023-345138,2023-05-31,000001,Vente,82000,5015,,LES AMANDIERS,B111,20214,2B049,Calenzana,2B,,,2B049000AC0152,,,152,26.78,,,,,,,,,1,2,Appartement,30,1,,,,,,8.860168,42.506395
2023-345185,2023-06-06,000001,Vente,48000,5015,,LES AMANDIERS,B111,20214,2B049,Calenzana,2B,,,2B049000AC0152,,,186,17.07,,,,,,,,,1,2,Appartement,21,2,,,,,,8.860168,42.506395
2023-345216,2023-06-14,000002,Vente,2500,,,ASTRO,B009,20214,2B049,Calenzana,2B,,,2B0490000F1856,,,,,,,,,,,,,0,,,,,T,terres,,,1590,8.818094,42.531455
2023-345243,2023-06-06,000002,Vente,3520,,,PIETRALBA,B072,20214,2B049,Calenzana,2B,,,2B0490000F1847,,,,,,,,,,,,,0,,,,,T,terres,,,704,8.810936,42.526128
2023-345244,2023-06-06,000001,Vente,6915,,,PIETRALBA,B072,20214,2B049,Calenzana,2B,,,2B0490000F1848,,,,,,,,,,,,,0,,,,,T,terres,,,1383,8.810881,42.525987
2023-345312,2023-06-01,000001,Vente,360000,1410,,CHEM DE VETRICELLO,0721,20214,2B049,Calenzana,2B,,,2B0490000F1410,,,,,,,,,,,,,0,1,Maison,91,4,S,sols,,,593,8.810505,42.533295
2023-345342,2023-06-28,000002,Vente,100000,,,CASACURIA,B541,20214,2B049,Calenzana,2B,,,2B0490000J0985,,,,,,,,,,,,,0,,,,,T,terres,,,2473,8.861658,42.507161
2023-345342,2023-06-28,000002,Vente,100000,,,CASACURIA,B541,20214,2B049,Calenzana,2B,,,2B0490000J0989,,,,,,,,,,,,,0,,,,,T,terres,,,638,8.861482,42.506796
2023-345356,2023-06-14,000001,Vente,116200,,,POGGIALE,B530,20214,2B049,Calenzana,2B,,,2B0490000J0932,,,,,,,,,,,,,0,,,,,AB,terrains a bâtir,,,524,8.854225,42.513933
2023-345356,2023-06-14,000001,Vente,116200,,,POGGIALE,B530,20214,2B049,Calenzana,2B,,,2B0490000J0938,,,,,,,,,,,,,0,,,,,AB,terrains a bâtir,,,524,8.854593,42.513911
2023-345356,2023-06-14,000001,Vente,116200,,,POGGIALE,B530,20214,2B049,Calenzana,2B,,,2B0490000J0946,,,,,,,,,,,,,0,,,,,AB,terrains a bâtir,,,1652,8.854999,42.513698
2023-345356,2023-06-14,000001,Vente,116200,,,POGGIALE,B530,20214,2B049,Calenzana,2B,,,2B0490000J0947,,,,,,,,,,,,,0,,,,,AB,terrains a bâtir,,,854,8.8554,42.514009
2023-345356,2023-06-14,000001,Vente,116200,,,POGGIALE,B530,20214,2B049,Calenzana,2B,,,2B0490000J0949,,,,,,,,,,,,,0,,,,,AB,terrains a bâtir,,,14,8.855459,42.513134
2023-345485,2023-06-27,000001,Vente,70000,5177,,OLMO,B066,20214,2B049,Calenzana,2B,,,2B049000AB0325,,,,,,,,,,,,,0,3,Dépendance,,0,S,sols,,,40,8.855691,42.507145
2023-345485,2023-06-27,000001,Vente,70000,5177,,OLMO,B066,20214,2B049,Calenzana,2B,,,2B049000AB0325,,,,,,,,,,,,,0,3,Dépendance,,0,S,sols,,,40,8.855691,42.507145
2023-345767,2023-07-18,000001,Vente,402000,5315,,CARUGLIOLO,B029,20214,2B049,Calenzana,2B,,,2B049000AB0440,,,,,,,,,,,,,0,1,Maison,36,3,S,sols,,,146,8.856132,42.505879
2023-345778,2023-07-24,000001,Vente,190000,378,,RES FABIANI,A702,20214,2B049,Calenzana,2B,,,2B049000AC0378,,,69,57.1,,,,,,,,,1,2,Appartement,57,2,,,,,,8.856751,42.507845
2023-345780,2023-07-10,000001,Vente,145620,5447,,FRUSTA,B049,20214,2B049,Calenzana,2B,,,2B049000AB0091,,,,,,,,,,,,,0,1,Maison,40,3,S,sols,,,30,8.853543,42.507062
2023-345880,2023-08-08,000001,Vente,388146,5000,,CHEM DE VETRICELLO,0721,20214,2B049,Calenzana,2B,,,2B0490000F1584,,,,,,,,,,,,,0,1,Maison,90,4,S,sols,,,314,8.80983,42.53322
2023-345948,2023-08-04,000001,Vente,90000,5463,,LA FRUSTA,B054,20214,2B049,Calenzana,2B,,,2B049000AB0072,,,4,,5,,,,,,,,2,3,Dépendance,,0,,,,,,8.853913,42.507506
2023-345948,2023-08-04,000001,Vente,90000,5463,,LA FRUSTA,B054,20214,2B049,Calenzana,2B,,,2B049000AB0072,,,4,,5,,,,,,,,2,2,Appartement,16,2,,,,,,8.853913,42.507506
2023-345948,2023-08-04,000001,Vente,90000,5463,,LA FRUSTA,B054,20214,2B049,Calenzana,2B,,,2B049000AB0072,,,6,,7,,,,,,,,2,2,Appartement,17,1,,,,,,8.853913,42.507506
2023-345948,2023-08-04,000001,Vente,90000,5463,,LA FRUSTA,B054,20214,2B049,Calenzana,2B,,,2B049000AB0072,,,6,,7,,,,,,,,2,3,Dépendance,,0,,,,,,8.853913,42.507506
2023-345948,2023-08-04,000001,Vente,90000,5463,,LA FRUSTA,B054,20214,2B049,Calenzana,2B,,,2B049000AB0072,,,4,,5,,,,,,,,2,3,Dépendance,,0,,,,,,8.853913,42.507506
2023-345999,2023-08-03,000001,Vente,115000,,,POGGIALE,B530,20214,2B049,Calenzana,2B,,,2B0490000J0927,,,,,,,,,,,,,0,,,,,AB,terrains a bâtir,,,567,8.854958,42.513148
2023-345999,2023-08-03,000001,Vente,115000,,,POGGIALE,B530,20214,2B049,Calenzana,2B,,,2B0490000J0932,,,,,,,,,,,,,0,,,,,AB,terrains a bâtir,,,524,8.854225,42.513933
2023-345999,2023-08-03,000001,Vente,115000,,,POGGIALE,B530,20214,2B049,Calenzana,2B,,,2B0490000J0946,,,,,,,,,,,,,0,,,,,AB,terrains a bâtir,,,1652,8.854999,42.513698
2023-345999,2023-08-03,000001,Vente,115000,,,POGGIALE,B530,20214,2B049,Calenzana,2B,,,2B0490000J0947,,,,,,,,,,,,,0,,,,,AB,terrains a bâtir,,,854,8.8554,42.514009
2023-345999,2023-08-03,000001,Vente,115000,,,POGGIALE,B530,20214,2B049,Calenzana,2B,,,2B0490000J0949,,,,,,,,,,,,,0,,,,,AB,terrains a bâtir,,,14,8.855459,42.513134
2023-346036,2023-08-21,000001,Vente,4300,,,CRUVILLAJO,B364,20214,2B049,Calenzana,2B,,,2B0490000F0566,,,,,,,,,,,,,0,,,,,B,bois,MAQUI,Maquis,2310,8.843899,42.517086
2023-346036,2023-08-21,000001,Vente,4300,,,VALDO MINUTO,B372,20214,2B049,Calenzana,2B,,,2B0490000F0615,,,,,,,,,,,,,0,,,,,VI,vignes,,,5412,8.84185,42.515723
2023-346036,2023-08-21,000001,Vente,4300,,,VALDO MINUTO,B372,20214,2B049,Calenzana,2B,,,2B0490000F0616,,,,,,,,,,,,,0,,,,,S,sols,,,21,8.842304,42.515764
2023-346036,2023-08-21,000001,Vente,4300,,,LUCCIANELLO,B367,20214,2B049,Calenzana,2B,,,2B0490000F0648,,,,,,,,,,,,,0,,,,,T,terres,,,6800,8.845159,42.519777
2023-346041,2023-08-17,000001,Vente,310000,5548,,PIAN D AREGNO,B070,20214,2B049,Calenzana,2B,,,2B049000AB0889,,,,,,,,,,,,,0,1,Maison,119,5,S,sols,,,700,8.849116,42.509256
2023-346041,2023-08-17,000001,Vente,310000,5548,,PIAN D AREGNO,B070,20214,2B049,Calenzana,2B,,,2B049000AB0889,,,,,,,,,,,,,0,1,Maison,119,5,J,jardins,,,1068,8.849116,42.509256
2023-346051,2023-08-10,000001,Vente,178000,,,CUTALELLO,B041,20214,2B049,Calenzana,2B,,,2B049000AB0664,,,,,,,,,,,,,0,,,,,AB,terrains a bâtir,,,907,8.848468,42.50828
2023-346361,2023-09-11,000001,Vente,435000,,,CARBONAJA,B024,20214,2B049,Calenzana,2B,,,2B049000AC0422,,,,,,,,,,,,,0,,,,,AB,terrains a bâtir,,,4348,8.858494,42.510407
2023-346390,2023-09-26,000001,Vente,10000,,,COLLO,B314,20214,2B049,Calenzana,2B,,,2B0490000H0166,,,,,,,,,,,,,0,,,,,L,landes,FRICH,Friche,47413,8.821285,42.456556
2023-346470,2023-09-15,000001,Vente,109000,,,POGGIALE,B530,20214,2B049,Calenzana,2B,,,2B0490000J0932,,,,,,,,,,,,,0,,,,,AB,terrains a bâtir,,,524,8.854225,42.513933
2023-346470,2023-09-15,000001,Vente,109000,,,POGGIALE,B530,20214,2B049,Calenzana,2B,,,2B0490000J0935,,,,,,,,,,,,,0,,,,,AB,terrains a bâtir,,,478,8.855012,42.514413
2023-346470,2023-09-15,000001,Vente,109000,,,POGGIALE,B530,20214,2B049,Calenzana,2B,,,2B0490000J0946,,,,,,,,,,,,,0,,,,,AB,terrains a bâtir,,,1652,8.854999,42.513698
2023-346470,2023-09-15,000001,Vente,109000,,,POGGIALE,B530,20214,2B049,Calenzana,2B,,,2B0490000J0947,,,,,,,,,,,,,0,,,,,AB,terrains a bâtir,,,854,8.8554,42.514009
2023-346470,2023-09-15,000001,Vente,109000,,,POGGIALE,B530,20214,2B049,Calenzana,2B,,,2B0490000J0949,,,,,,,,,,,,,0,,,,,AB,terrains a bâtir,,,14,8.855459,42.513134
2023-346569,2023-09-25,000001,Vente,467116.84,,,MEZZANODE,B063,20214,2B049,Calenzana,2B,,,2B0490000E0739,,,,,,,,,,,,,0,,,,,L,landes,FRICH,Friche,320,8.794945,42.500779
2023-346569,2023-09-25,000001,Vente,467116.84,,,LA PARATELLA,B329,20214,2B049,Calenzana,2B,,,2B0490000E0740,,,,,,,,,,,,,0,,,,,L,landes,FRICH,Friche,212,8.794129,42.500684
2023-346569,2023-09-25,000001,Vente,467116.84,5971,,MEZZANODE,B063,20214,2B049,Calenzana,2B,,,2B0490000E0819,,,,,,,,,,,,,0,1,Maison,149,4,T,terres,,,566,8.794868,42.501023
2023-346569,2023-09-25,000001,Vente,467116.84,5971,,MEZZANODE,B063,20214,2B049,Calenzana,2B,,,2B0490000E0819,,,,,,,,,,,,,0,1,Maison,149,4,S,sols,,,1723,8.794868,42.501023
2023-346615,2023-10-17,000001,Vente,499000,,,PIETRALBA,B072,20214,2B049,Calenzana,2B,,,2B0490000F1573,,,,,,,,,,,,,0,,,,,S,sols,,,98,8.806861,42.531563
2023-346615,2023-10-17,000001,Vente,499000,1575,,PIETRALBA,B072,20214,2B049,Calenzana,2B,,,2B0490000F1575,,,,,,,,,,,,,0,1,Maison,97,4,S,sols,,,285,8.806705,42.53164
2023-346615,2023-10-17,000001,Vente,499000,,,PIETRALBA,B072,20214,2B049,Calenzana,2B,,,2B0490000F1578,,,,,,,,,,,,,0,,,,,AB,terrains a bâtir,,,446,8.80687,42.53164
2023-346627,2023-10-02,000001,Vente,767000,,,ASTRO,B009,20214,2B049,Calenzana,2B,,,2B0490000F1545,,,,,,,,,,,,,0,,,,,L,landes,FRICH,Friche,27,8.812905,42.529852
2023-346627,2023-10-02,000001,Vente,767000,1632,,ASTRO,B009,20214,2B049,Calenzana,2B,,,2B0490000F1632,,,,,,,,,,,,,0,1,Maison,161,4,S,sols,,,1107,8.812854,42.530269
2023-346627,2023-10-02,000001,Vente,767000,,,ASTRO,B009,20214,2B049,Calenzana,2B,,,2B0490000F1634,,,,,,,,,,,,,0,,,,,L,landes,FRICH,Friche,285,8.812992,42.530057
2023-346721,2023-10-27,000001,Vente,155000,5291,,PARIGGI,B067,20214,2B049,Calenzana,2B,,,2B049000AB0459,,,,,,,,,,,,,0,1,Maison,50,4,S,sols,,,26,8.856201,42.506468
2023-346789,2023-10-26,000001,Vente,250000,,,FIGARELLA,B043,20214,2B049,Calenzana,2B,,,2B0490000E0555,,,,,,,,,,,,,0,,,,,J,jardins,,,1840,8.804538,42.486834