id_mutation,date_mutation,numero_disposition,nature_mutation,valeur_fonciere,adresse_numero,adresse_suffixe,adresse_nom_voie,adresse_code_voie,code_postal,code_commune,nom_commune,code_departement,ancien_code_commune,ancien_nom_commune,id_parcelle,ancien_id_parcelle,numero_volume,lot1_numero,lot1_surface_carrez,lot2_numero,lot2_surface_carrez,lot3_numero,lot3_surface_carrez,lot4_numero,lot4_surface_carrez,lot5_numero,lot5_surface_carrez,nombre_lots,code_type_local,type_local,surface_reelle_bati,nombre_pieces_principales,code_nature_culture,nature_culture,code_nature_culture_speciale,nature_culture_speciale,surface_terrain,longitude,latitude
2023-344284,2023-03-16,000001,Vente,117000,,,MERGONAJO,B136,20237,2B101,Croce,2B,,,2B1010000B0044,,,,,,,,,,,,,0,,,,,VE,vergers,CHAT,Châtaigneraie,518,9.359757,42.414452
2023-344284,2023-03-16,000001,Vente,117000,,,MERGONAJO,B136,20237,2B101,Croce,2B,,,2B1010000B0045,,,,,,,,,,,,,0,,,,,VE,vergers,CHAT,Châtaigneraie,135,9.359579,42.414366
2023-344284,2023-03-16,000001,Vente,117000,46,,MERGONAJO,B136,20237,2B101,Croce,2B,,,2B1010000B0046,,,,,,,,,,,,,0,1,Maison,79,3,S,sols,,,303,9.359631,42.414284
2023-346279,2023-08-16,000001,Vente,60000,,,STRISCIE,B235,20237,2B101,Croce,2B,,,2B1010000E0139,,,,,,,,,,,,,0,,,,,B,bois,MAQUI,Maquis,742,9.35717,42.408796
2023-346279,2023-08-16,000001,Vente,60000,5054,,POGGIO,B194,20237,2B101,Croce,2B,,,2B1010000E0177,,,4,,5,,6,,,,,,3,2,Appartement,51,3,,,,,,9.357767,42.408989
2023-346279,2023-08-16,000001,Vente,60000,5054,,POGGIO,B194,20237,2B101,Croce,2B,,,2B1010000E0177,,,10,,9,123,,,,,,,2,2,Appartement,34,2,,,,,,9.357767,42.408989
2023-346279,2023-08-16,000001,Vente,60000,5054,,POGGIO,B194,20237,2B101,Croce,2B,,,2B1010000E0177,,,10,,9,123,,,,,,,2,3,Dépendance,,0,,,,,,9.357767,42.408989
2023-346279,2023-08-16,000001,Vente,60000,5054,,POGGIO,B194,20237,2B101,Croce,2B,,,2B1010000E0177,,,4,,5,,6,,,,,,3,3,Dépendance,,0,,,,,,9.357767,42.408989
2023-346803,2023-10-19,000001,Vente,170000,5083,,STRISCIE,B235,20237,2B101,Croce,2B,,,2B1010000E0144,,,,,,,,,,,,,0,1,Maison,80,3,S,sols,,,378,9.356864,42.409241
2023-346953,2023-10-26,000001,Vente,6000,,,SAN GUILICO,B213,20237,2B101,Croce,2B,,,2B1010000C0265,,,,,,,,,,,,,0,,,,,B,bois,MAQUI,Maquis,3740,9.388396,42.400627
2023-346953,2023-10-26,000001,Vente,6000,,,SAN GUILICO,B213,20237,2B101,Croce,2B,,,2B1010000C0266,,,,,,,,,,,,,0,,,,,BT,taillis simples,CHAT,Châtaigneraie,7220,9.388874,42.400498
2023-346953,2023-10-26,000001,Vente,6000,,,SAN GUILICO,B213,20237,2B101,Croce,2B,,,2B1010000C0268,,,,,,,,,,,,,0,,,,,B,bois,MAQUI,Maquis,5560,9.38886,42.399753
2023-346953,2023-10-26,000001,Vente,6000,,,SAN GUILICO,B213,20237,2B101,Croce,2B,,,2B1010000C0269,,,,,,,,,,,,,0,,,,,BT,taillis simples,CHAT,Châtaigneraie,7995,9.389041,42.399294
2023-346953,2023-10-26,000001,Vente,6000,,,SAN GUILICO,B213,20237,2B101,Croce,2B,,,2B1010000C0270,,,,,,,,,,,,,0,,,,,B,bois,MAQUI,Maquis,3190,9.389333,42.399
